{"text_format":"2","workbook":"xlsx","n_sheets":8,"sheets":["封面","电压测量通道","普通低端电阻测量通道","普通高端电阻测量通道","恒流低端电阻测量通道","Parameters","Summary","Global_Config"],"not_rendered":{"charts":0,"images":1,"macros":1,"external_links":0,"defined_names":0,"comments":0,"pivot_tables":0},"unopened":[],"bounds":{"document_bytes":16777216,"sheet_cells":100000,"run_cost":"one","rows_first":2000,"rows_last":500,"rows_between":2000,"halvings":0,"cell_chars":16384,"cell_head_chars":4096},"cells_cut":0,"cells_raw":0,"read":"whole","date_system":"1900"}

{"sheet":"封面","index":0,"n_rows":21,"n_cols":4,"rows_kept":21,"cut":false,"hidden":false,"merged":[[20,2,20,3],[23,1,23,3],[2,0,2,4],[7,1,7,3],[8,1,8,3],[9,1,9,3],[14,1,14,3]]}
[]
[]
["模拟信号转换配置"]
[]
[]
[]
[]
[null,"填写说明："]
[null,"1.此配置工具包含多个页面，应切换各个页面，将需要的所有的通道全部妥善配置"]
[null,"2.全局设置符合应用环境，所有通道均正确配置的情况下，点击“生成配置文件”按钮完成配置"]
{"$rows_left_out":12}
{"sheet":"电压测量通道","index":1,"n_rows":271,"n_cols":23,"rows_kept":271,"cut":false,"hidden":false,"merged":[[0,0,0,25],[1,0,1,25],[3,3,3,5],[4,2,4,5],[4,6,4,24],[5,16,5,24],[13,13,13,16],[15,13,15,15],[16,13,16,15],[16,16,16,17],[22,20,22,23],[23,13,23,16],[23,19,23,20],[23,21,23,22],[27,7,27,10],[30,3,30,5],[31,2,31,5],[31,6,31,24],[32,16,32,24],[40,13,40,16],[42,13,42,15],[43,13,43,15],[43,16,43,17],[49,20,49,23],[50,13,50,16],[50,19,50,20],[50,21,50,22],[54,7,54,10],[57,3,57,5],[58,2,58,5],[58,6,58,24],[59,16,59,24],[67,13,67,16],[69,13,69,15],[70,13,70,15],[70,16,70,17],[76,20,76,23],[77,13,77,16],[77,19,77,20],[77,21,77,22],[81,7,81,10],[84,3,84,5],[85,2,85,5],[85,6,85,24],[86,16,86,24],[94,13,94,16],[96,13,96,15],[97,13,97,15],[97,16,97,17],[103,20,103,23],[104,13,104,16],[104,19,104,20],[104,21,104,22],[108,7,108,10],[111,3,111,5],[112,2,112,5],[112,6,112,24],[113,16,113,24],[121,13,121,16],[123,13,123,15],[124,13,124,15],[124,16,124,17],[130,20,130,23],[131,13,131,16],[131,19,131,20],[131,21,131,22],[125,18,126,21],[165,3,165,5],[166,2,166,5],[166,6,166,24],[167,16,167,24],[135,7,135,10],[138,3,138,5],[139,2,139,5],[139,6,139,24],[140,16,140,24],[148,13,148,16],[150,13,150,15],[151,13,151,15],[151,16,151,17],[145,18,146,24],[152,18,153,21],[152,22,153,24],[157,20,157,23],[158,13,158,16],[158,19,158,20],[158,21,158,22],[162,7,162,10],[211,20,211,23],[175,13,175,16],[177,13,177,15],[178,13,178,15],[178,16,178,17],[184,20,184,23],[185,13,185,16],[185,19,185,20],[185,21,185,22],[246,3,246,5],[212,13,212,16],[212,19,212,20],[212,21,212,22],[216,7,216,10],[219,3,219,5],[220,2,220,5],[220,6,220,24],[221,16,221,24],[229,13,229,16],[226,18,227,24],[253,18,254,24],[231,13,231,15],[232,13,232,15],[232,16,232,17],[238,20,238,23],[239,13,239,16],[239,19,239,20],[239,21,239,22],[243,7,243,10],[270,7,270,10],[2,0,28,0],[29,0,55,0],[56,0,82,0],[83,0,109,0],[110,0,136,0],[137,0,163,0],[164,0,190,0],[191,0,217,0],[218,0,244,0],[245,0,271,0],[250,2,251,3],[223,2,224,3],[247,2,247,5],[247,6,247,24],[248,16,248,24],[256,13,256,16],[258,13,258,15],[259,13,259,15],[259,16,259,17],[265,20,265,23],[266,13,266,16],[266,19,266,20],[266,21,266,22],[17,18,18,21],[17,22,18,24],[10,18,11,24],[7,2,8,3],[125,22,126,24],[91,18,92,24],[64,18,65,24],[44,22,45,24],[260,18,261,21],[260,22,261,24],[233,18,234,21],[233,22,234,24],[61,2,62,3],[34,2,35,3],[37,18,38,24],[44,18,45,21],[88,2,89,3],[71,18,72,21],[71,22,72,24],[98,18,99,21],[98,22,99,24],[142,2,143,3],[115,2,116,3],[118,18,119,24],[169,2,170,3],[172,18,173,24],[179,18,180,21],[179,22,180,24],[196,2,197,3],[199,18,200,24],[206,22,207,24],[206,18,207,21],[192,3,192,5],[193,2,193,5],[193,6,193,24],[194,16,194,24],[202,13,202,16],[204,13,204,15],[205,13,205,15],[205,16,205,17],[189,7,189,10]]}
["电压测量通道"]
["所有通道全部配置完成后，转到封面页点击“生成配置文件”按钮"]
[1]
[null,null,null,"使用此通道"]
[null,null,"通道名称",null,null,null,"ADC_CH_KL30_VOLTAGE"]
[{"$nulls":16},"*测量得到的电压值单位为mV"]
[]
[null,null,"被测电压信号"]
[]
[]
{"$rows_left_out":262}
{"sheet":"普通低端电阻测量通道","index":2,"n_rows":271,"n_cols":43,"rows_kept":271,"cut":false,"hidden":false,"merged":[[0,0,0,45],[1,0,1,45],[4,2,4,7],[4,8,4,29],[4,32,4,36],[4,37,4,41],[6,10,6,13],[6,14,6,20],[6,21,6,24],[6,25,6,38],[6,39,6,40],[12,20,12,21],[13,20,13,21],[13,22,13,25],[15,10,15,12],[15,22,15,24],[15,33,15,35],[16,10,16,12],[16,13,16,15],[16,22,16,24],[16,25,16,27],[16,33,16,35],[23,2,23,3],[23,33,23,36],[23,39,23,40],[23,41,23,42],[27,4,27,7],[27,27,27,30],[31,2,31,7],[31,8,31,29],[31,32,31,36],[31,37,31,41],[33,10,33,13],[33,14,33,20],[33,21,33,24],[33,25,33,38],[33,39,33,40],[39,20,39,21],[40,20,40,21],[40,22,40,25],[42,10,42,12],[42,22,42,24],[42,33,42,35],[37,38,38,44],[43,10,43,12],[43,13,43,15],[43,22,43,24],[43,25,43,27],[43,33,43,35],[43,36,43,37],[49,40,49,43],[50,2,50,3],[50,33,50,36],[50,39,50,40],[50,41,50,42],[44,38,45,41],[44,42,45,44],[54,4,54,7],[54,27,54,30],[58,2,58,7],[58,8,58,29],[58,32,58,36],[58,37,58,41],[60,10,60,13],[60,14,60,20],[60,21,60,24],[60,25,60,38],[60,39,60,40],[66,20,66,21],[67,20,67,21],[67,22,67,25],[69,10,69,12],[69,22,69,24],[69,33,69,35],[70,10,70,12],[70,13,70,15],[70,22,70,24],[70,25,70,27],[70,33,70,35],[77,2,77,3],[77,33,77,36],[77,39,77,40],[77,41,77,42],[81,4,81,7],[81,27,81,30],[85,2,85,7],[85,8,85,29],[85,32,85,36],[85,37,85,41],[87,10,87,13],[87,14,87,20],[87,21,87,24],[87,25,87,38],[87,39,87,40],[93,20,93,21],[94,20,94,21],[94,22,94,25],[96,10,96,12],[96,22,96,24],[96,33,96,35],[97,10,97,12],[97,13,97,15],[97,22,97,24],[97,25,97,27],[97,33,97,35],[97,36,97,37],[103,40,103,43],[104,2,104,3],[104,33,104,36],[104,39,104,40],[104,41,104,42],[108,4,108,7],[108,27,108,30],[112,2,112,7],[112,8,112,29],[112,32,112,36],[112,37,112,41],[114,10,114,13],[114,14,114,20],[114,21,114,24],[114,25,114,38],[114,39,114,40],[120,20,120,21],[121,20,121,21],[121,22,121,25],[123,10,123,12],[123,22,123,24],[123,33,123,35],[124,10,124,12],[124,13,124,15],[124,22,124,24],[124,25,124,27],[124,33,124,35],[124,36,124,37],[130,40,130,43],[131,2,131,3],[131,33,131,36],[131,39,131,40],[131,41,131,42],[135,4,135,7],[135,27,135,30],[139,2,139,7],[139,8,139,29],[139,32,139,36],[139,37,139,41],[125,38,126,41],[125,42,126,44],[141,10,141,13],[141,14,141,20],[141,21,141,24],[141,25,141,38],[141,39,141,40],[147,20,147,21],[148,20,148,21],[148,22,148,25],[150,10,150,12],[150,22,150,24],[150,33,150,35],[145,38,146,44],[151,10,151,12],[151,13,151,15],[151,22,151,24],[151,25,151,27],[151,33,151,35],[151,36,151,37],[157,40,157,43],[158,2,158,3],[158,33,158,36],[158,39,158,40],[158,41,158,42],[152,38,153,41],[152,42,153,44],[162,4,162,7],[162,27,162,30],[166,2,166,7],[166,8,166,29],[166,32,166,36],[166,37,166,41],[168,10,168,13],[168,14,168,20],[168,21,168,24],[168,25,168,38],[168,39,168,40],[174,20,174,21],[175,20,175,21],[175,22,175,25],[177,10,177,12],[177,22,177,24],[177,33,177,35],[178,10,178,12],[178,13,178,15],[178,22,178,24],[178,25,178,27],[178,33,178,35],[185,2,185,3],[185,33,185,36],[185,39,185,40],[185,41,185,42],[189,4,189,7],[189,27,189,30],[193,2,193,7],[193,8,193,29],[193,32,193,36],[193,37,193,41],[195,10,195,13],[195,14,195,20],[195,21,195,24],[195,25,195,38],[195,39,195,40],[201,20,201,21],[202,20,202,21],[202,22,202,25],[204,10,204,12],[204,22,204,24],[204,33,204,35],[205,10,205,12],[205,13,205,15],[205,22,205,24],[205,25,205,27],[205,33,205,35],[205,36,205,37],[211,40,211,43],[212,2,212,3],[212,33,212,36],[212,39,212,40],[212,41,212,42],[216,4,216,7],[216,27,216,30],[220,2,220,7],[220,8,220,29],[220,32,220,36],[220,37,220,41],[222,10,222,13],[222,14,222,20],[222,21,222,24],[222,25,222,38],[222,39,222,40],[233,38,234,41],[233,42,234,44],[228,20,228,21],[229,20,229,21],[229,22,229,25],[231,10,231,12],[231,22,231,24],[231,33,231,35],[232,10,232,12],[232,13,232,15],[232,22,232,24],[232,25,232,27],[232,33,232,35],[238,40,238,43],[239,2,239,3],[239,33,239,36],[239,39,239,40],[239,41,239,42],[243,4,243,7],[243,27,243,30],[247,2,247,7],[247,8,247,29],[247,32,247,36],[247,37,247,41],[265,40,265,43],[266,2,266,3],[266,33,266,36],[266,39,266,40],[266,41,266,42],[260,38,261,41],[260,42,261,44],[249,10,249,13],[249,14,249,20],[249,21,249,24],[249,25,249,38],[249,39,249,40],[255,20,255,21],[256,20,256,21],[256,22,256,25],[258,10,258,12],[258,22,258,24],[258,33,258,35],[253,38,254,44],[270,4,270,7],[270,27,270,30],[2,0,28,0],[29,0,55,0],[56,0,82,0],[83,0,109,0],[110,0,136,0],[137,0,163,0],[164,0,190,0],[191,0,217,0],[218,0,244,0],[245,0,271,0],[250,26,251,36],[169,26,170,36],[142,26,143,36],[61,26,62,36],[34,26,35,36],[259,10,259,12],[259,13,259,15],[259,22,259,24],[259,25,259,27],[259,33,259,35],[259,36,259,37],[232,36,232,37],[226,38,227,44],[223,26,224,36],[196,26,197,36],[199,38,200,44],[206,38,207,41],[206,42,207,44],[179,38,180,41],[179,42,180,44],[172,38,173,44],[178,36,178,37],[184,40,184,43],[10,38,11,44],[7,26,8,36],[17,38,18,41],[17,42,18,44],[118,38,119,44],[115,26,116,36],[88,26,89,36],[91,38,92,44],[98,38,99,41],[98,42,99,44],[71,38,72,41],[71,42,72,44],[64,38,65,44],[70,36,70,37],[76,40,76,43],[16,36,16,37],[22,40,22,43]]}
[" 普通低端电阻测量通道"]
["所有通道全部配置完成后，转到封面页点击“生成配置文件”按钮"]
[1]
[null,null,null,"使用此通道"]
[null,null,"通道名称",{"$nulls":5},"ADC_CH_FUEL1",{"$nulls":23},"电阻值输出单位"]
[]
[{"$nulls":10},"参考电源选择",{"$nulls":10},{"$f":"IF(Summary!$F12=2,\"通道名称\",\"电压\")","v":"通道名称"},null,null,null,"ADC_CH_FUEL_VREF",{"$nulls":13},{"$f":"IF(Summary!$F12=2,\"\",\"mV\")","v":""}]
[{"$nulls":26},"(参考电源选择为VREF时此格无效)"]
[]
[]
{"$rows_left_out":262}
{"sheet":"普通高端电阻测量通道","index":3,"n_rows":271,"n_cols":43,"rows_kept":271,"cut":false,"hidden":false,"merged":[[0,0,0,45],[1,0,1,45],[4,2,4,7],[4,8,4,29],[4,32,4,36],[4,37,4,41],[6,2,6,3],[6,4,6,9],[6,10,6,13],[6,14,6,32],[6,33,6,34],[2,0,28,0],[13,2,13,3],[15,10,15,12],[15,22,15,24],[15,33,15,35],[16,10,16,12],[16,13,16,15],[16,22,16,24],[16,25,16,27],[16,33,16,35],[16,36,16,37],[22,20,22,21],[22,40,22,43],[23,20,23,21],[23,22,23,25],[23,33,23,36],[23,39,23,40],[23,41,23,42],[27,15,27,18],[27,27,27,30],[31,2,31,7],[31,8,31,29],[31,32,31,36],[31,37,31,41],[33,2,33,3],[33,4,33,9],[33,10,33,13],[33,14,33,32],[33,33,33,34],[40,2,40,3],[42,10,42,12],[42,22,42,24],[42,33,42,35],[34,19,35,31],[43,10,43,12],[43,13,43,15],[43,22,43,24],[43,25,43,27],[43,33,43,35],[43,36,43,37],[49,20,49,21],[49,40,49,43],[50,20,50,21],[50,22,50,25],[50,33,50,36],[50,39,50,40],[50,41,50,42],[54,15,54,18],[54,27,54,30],[44,38,45,41],[44,42,45,44],[58,2,58,7],[58,8,58,29],[58,32,58,36],[58,37,58,41],[60,2,60,3],[60,4,60,9],[60,10,60,13],[60,14,60,32],[60,33,60,34],[76,40,76,43],[77,20,77,21],[77,22,77,25],[77,33,77,36],[77,39,77,40],[77,41,77,42],[81,15,81,18],[81,27,81,30],[67,2,67,3],[69,10,69,12],[69,22,69,24],[69,33,69,35],[70,10,70,12],[70,13,70,15],[70,22,70,24],[70,25,70,27],[70,33,70,35],[85,2,85,7],[85,8,85,29],[85,32,85,36],[85,37,85,41],[87,2,87,3],[87,4,87,9],[87,10,87,13],[87,14,87,32],[87,33,87,34],[108,15,108,18],[108,27,108,30],[94,2,94,3],[96,10,96,12],[96,22,96,24],[96,33,96,35],[97,10,97,12],[97,13,97,15],[97,22,97,24],[97,25,97,27],[97,33,97,35],[112,2,112,7],[112,8,112,29],[112,32,112,36],[112,37,112,41],[114,2,114,3],[114,4,114,9],[114,10,114,13],[114,14,114,32],[114,33,114,34],[131,41,131,42],[135,15,135,18],[135,27,135,30],[121,2,121,3],[123,10,123,12],[123,22,123,24],[123,33,123,35],[124,10,124,12],[124,13,124,15],[124,22,124,24],[124,25,124,27],[124,33,124,35],[139,2,139,7],[139,8,139,29],[139,32,139,36],[139,37,139,41],[141,2,141,3],[141,4,141,9],[141,10,141,13],[141,14,141,32],[141,33,141,34],[162,15,162,18],[162,27,162,30],[148,2,148,3],[150,10,150,12],[150,22,150,24],[150,33,150,35],[151,10,151,12],[151,13,151,15],[151,22,151,24],[151,25,151,27],[151,33,151,35],[166,2,166,7],[166,8,166,29],[166,32,166,36],[166,37,166,41],[168,2,168,3],[168,4,168,9],[168,10,168,13],[168,14,168,32],[168,33,168,34],[175,2,175,3],[177,10,177,12],[177,22,177,24],[177,33,177,35],[178,10,178,12],[178,13,178,15],[178,22,178,24],[178,25,178,27],[178,33,178,35],[178,36,178,37],[184,20,184,21],[184,40,184,43],[185,20,185,21],[185,22,185,25],[185,33,185,36],[185,39,185,40],[185,41,185,42],[189,15,189,18],[189,27,189,30],[179,38,180,41],[179,42,180,44],[193,2,193,7],[193,8,193,29],[193,32,193,36],[193,37,193,41],[195,2,195,3],[195,4,195,9],[195,10,195,13],[195,14,195,32],[195,33,195,34],[212,39,212,40],[212,41,212,42],[216,15,216,18],[216,27,216,30],[202,2,202,3],[204,10,204,12],[204,22,204,24],[204,33,204,35],[205,10,205,12],[205,13,205,15],[205,22,205,24],[205,25,205,27],[205,33,205,35],[220,2,220,7],[220,8,220,29],[220,32,220,36],[220,37,220,41],[222,2,222,3],[222,4,222,9],[222,10,222,13],[222,14,222,32],[222,33,222,34],[243,15,243,18],[243,27,243,30],[229,2,229,3],[231,10,231,12],[231,22,231,24],[231,33,231,35],[232,10,232,12],[232,13,232,15],[232,22,232,24],[232,25,232,27],[232,33,232,35],[247,2,247,7],[247,8,247,29],[247,32,247,36],[247,37,247,41],[249,2,249,3],[249,4,249,9],[249,10,249,13],[249,14,249,32],[249,33,249,34],[256,2,256,3],[258,10,258,12],[258,22,258,24],[258,33,258,35],[259,10,259,12],[259,13,259,15],[259,22,259,24],[259,25,259,27],[259,33,259,35],[259,36,259,37],[265,20,265,21],[265,40,265,43],[266,20,266,21],[266,22,266,25],[266,33,266,36],[266,39,266,40],[266,41,266,42],[270,15,270,18],[270,27,270,30],[260,38,261,41],[260,42,261,44],[29,0,55,0],[56,0,82,0],[83,0,109,0],[110,0,136,0],[137,0,163,0],[164,0,190,0],[191,0,217,0],[218,0,244,0],[245,0,271,0],[250,19,251,31],[253,38,254,44],[233,38,234,41],[233,42,234,44],[226,38,227,44],[223,19,224,31],[206,38,207,41],[206,42,207,44],[196,19,197,31],[199,38,200,44],[232,36,232,37],[238,20,238,21],[238,40,238,43],[239,20,239,21],[239,22,239,25],[239,33,239,36],[239,39,239,40],[239,41,239,42],[205,36,205,37],[211,20,211,21],[211,40,211,43],[212,20,212,21],[212,22,212,25],[212,33,212,36],[172,38,173,44],[169,19,170,31],[152,38,153,41],[152,42,153,44],[142,19,143,31],[145,38,146,44],[125,38,126,41],[125,42,126,44],[118,38,119,44],[151,36,151,37],[157,20,157,21],[157,40,157,43],[158,20,158,21],[158,22,158,25],[158,33,158,36],[158,39,158,40],[158,41,158,42],[124,36,124,37],[130,20,130,21],[130,40,130,43],[131,20,131,21],[131,22,131,25],[131,33,131,36],[131,39,131,40],[37,38,38,44],[17,42,18,44],[10,38,11,44],[17,38,18,41],[7,19,8,31],[115,19,116,31],[98,38,99,41],[98,42,99,44],[88,19,89,31],[91,38,92,44],[71,38,72,41],[71,42,72,44],[64,38,65,44],[61,19,62,31],[97,36,97,37],[103,20,103,21],[103,40,103,43],[104,20,104,21],[104,22,104,25],[104,33,104,36],[104,39,104,40],[104,41,104,42],[70,36,70,37],[76,20,76,21]]}
[" 普通高端电阻测量通道"]
["所有通道全部配置完成后，转到封面页点击“生成配置文件”按钮"]
[1]
[null,null,null,"使用此通道"]
[null,null,"通道名称",{"$nulls":5},"ADC_CH_NTC_R",{"$nulls":23},"电阻值输出单位"]
[]
[null,null,"参考电源选择",{"$nulls":7},{"$f":"IF(Summary!$F22=2,\"通道名称\",\"电压\")","v":"电压"},null,null,null,5000,{"$nulls":18},{"$f":"IF(Summary!$F22=2,\"\",\"mV\")","v":"mV"}]
[{"$nulls":19},"(参考电源选择为VREF时此格无效)"]
[]
[]
{"$rows_left_out":262}
{"sheet":"恒流低端电阻测量通道","index":4,"n_rows":271,"n_cols":43,"rows_kept":271,"cut":false,"hidden":false,"merged":[[0,0,0,45],[1,0,1,45],[4,2,4,7],[4,8,4,29],[4,32,4,36],[4,37,4,41],[6,15,6,18],[12,20,12,21],[13,20,13,22],[13,23,13,24],[10,38,11,44],[15,10,15,12],[15,22,15,24],[15,33,15,35],[16,10,16,12],[16,13,16,15],[16,22,16,24],[16,25,16,27],[16,33,16,35],[16,36,16,37],[23,2,23,3],[23,33,23,36],[23,39,23,40],[23,41,23,42],[27,4,27,7],[27,27,27,30],[31,2,31,7],[31,8,31,29],[31,32,31,36],[31,37,31,41],[33,15,33,18],[39,20,39,21],[40,20,40,22],[40,23,40,24],[42,10,42,12],[42,22,42,24],[42,33,42,35],[43,10,43,12],[43,13,43,15],[43,22,43,24],[43,25,43,27],[43,33,43,35],[43,36,43,37],[49,40,49,43],[50,2,50,3],[50,33,50,36],[50,39,50,40],[50,41,50,42],[54,4,54,7],[54,27,54,30],[58,2,58,7],[58,8,58,29],[58,32,58,36],[58,37,58,41],[60,15,60,18],[66,20,66,21],[67,20,67,22],[67,23,67,24],[69,10,69,12],[69,22,69,24],[69,33,69,35],[70,10,70,12],[70,13,70,15],[70,22,70,24],[70,25,70,27],[70,33,70,35],[70,36,70,37],[76,40,76,43],[77,2,77,3],[77,33,77,36],[77,39,77,40],[77,41,77,42],[81,4,81,7],[81,27,81,30],[85,2,85,7],[85,8,85,29],[85,32,85,36],[85,37,85,41],[87,15,87,18],[93,20,93,21],[94,20,94,22],[94,23,94,24],[96,10,96,12],[96,22,96,24],[96,33,96,35],[97,10,97,12],[97,13,97,15],[97,22,97,24],[97,25,97,27],[97,33,97,35],[97,36,97,37],[103,40,103,43],[104,2,104,3],[104,33,104,36],[104,39,104,40],[104,41,104,42],[108,4,108,7],[108,27,108,30],[112,2,112,7],[112,8,112,29],[112,32,112,36],[112,37,112,41],[114,15,114,18],[120,20,120,21],[121,20,121,22],[121,23,121,24],[123,10,123,12],[123,22,123,24],[123,33,123,35],[124,10,124,12],[124,13,124,15],[124,22,124,24],[124,25,124,27],[124,33,124,35],[124,36,124,37],[130,40,130,43],[131,2,131,3],[131,33,131,36],[131,39,131,40],[131,41,131,42],[135,4,135,7],[135,27,135,30],[139,2,139,7],[139,8,139,29],[139,32,139,36],[139,37,139,41],[125,38,126,41],[125,42,126,44],[141,15,141,18],[147,20,147,21],[148,20,148,22],[148,23,148,24],[150,10,150,12],[150,22,150,24],[150,33,150,35],[151,10,151,12],[151,13,151,15],[151,22,151,24],[151,25,151,27],[151,33,151,35],[151,36,151,37],[157,40,157,43],[158,2,158,3],[158,33,158,36],[158,39,158,40],[158,41,158,42],[162,4,162,7],[162,27,162,30],[166,2,166,7],[166,8,166,29],[166,32,166,36],[166,37,166,41],[168,15,168,18],[174,20,174,21],[175,20,175,22],[175,23,175,24],[177,10,177,12],[177,22,177,24],[177,33,177,35],[178,10,178,12],[178,13,178,15],[178,22,178,24],[178,25,178,27],[178,33,178,35],[178,36,178,37],[184,40,184,43],[185,2,185,3],[185,33,185,36],[185,39,185,40],[185,41,185,42],[189,4,189,7],[189,27,189,30],[193,2,193,7],[193,8,193,29],[193,32,193,36],[193,37,193,41],[195,15,195,18],[201,20,201,21],[202,20,202,22],[202,23,202,24],[204,10,204,12],[204,22,204,24],[204,33,204,35],[205,10,205,12],[205,13,205,15],[205,22,205,24],[205,25,205,27],[205,33,205,35],[205,36,205,37],[211,40,211,43],[212,2,212,3],[212,33,212,36],[212,39,212,40],[212,41,212,42],[216,4,216,7],[216,27,216,30],[220,2,220,7],[220,8,220,29],[220,32,220,36],[220,37,220,41],[222,15,222,18],[228,20,228,21],[229,20,229,22],[229,23,229,24],[231,10,231,12],[231,22,231,24],[231,33,231,35],[232,10,232,12],[232,13,232,15],[232,22,232,24],[232,25,232,27],[232,33,232,35],[232,36,232,37],[238,40,238,43],[239,2,239,3],[239,33,239,36],[239,39,239,40],[239,41,239,42],[243,4,243,7],[243,27,243,30],[247,2,247,7],[247,8,247,29],[247,32,247,36],[247,37,247,41],[249,15,249,18],[255,20,255,21],[256,20,256,22],[256,23,256,24],[258,10,258,12],[258,22,258,24],[258,33,258,35],[259,10,259,12],[259,13,259,15],[259,22,259,24],[259,25,259,27],[259,33,259,35],[259,36,259,37],[265,40,265,43],[266,2,266,3],[266,33,266,36],[266,39,266,40],[266,41,266,42],[270,4,270,7],[270,27,270,30],[2,0,28,0],[29,0,55,0],[56,0,82,0],[83,0,109,0],[110,0,136,0],[137,0,163,0],[164,0,190,0],[191,0,217,0],[218,0,244,0],[245,0,271,0],[253,38,254,44],[260,38,261,41],[260,42,261,44],[226,38,227,44],[233,38,234,41],[233,42,234,44],[199,38,200,44],[206,38,207,41],[206,42,207,44],[179,38,180,41],[179,42,180,44],[172,38,173,44],[145,38,146,44],[152,38,153,41],[152,42,153,44],[17,38,18,41],[17,42,18,44],[118,38,119,44],[91,38,92,44],[98,38,99,41],[98,42,99,44],[71,38,72,41],[71,42,72,44],[64,38,65,44],[37,38,38,44],[44,38,45,41],[44,42,45,44],[22,40,22,43]]}
["恒流低端电阻测量通道"]
["所有通道全部配置完成后，转到封面页点击“生成配置文件”按钮"]
[1]
[null,null,null,"使用此通道"]
[null,null,"通道名称",{"$nulls":5},"ADC_CH_BRIGHTNESS_R",{"$nulls":23},"电阻值输出单位"]
[]
[{"$nulls":15}," VS"]
[]
[]
[]
{"$rows_left_out":262}
{"sheet":"Parameters","index":5,"n_rows":18,"n_cols":7,"rows_kept":18,"cut":false,"hidden":false,"merged":[[0,2,0,4],[0,0,1,0],[0,1,1,1],[0,5,1,5],[0,6,1,6]]}
["Unit","Power\nSource","Pin Configuration",null,null,"Calibration","Res\nOutput"]
[null,null,"Pin ","Analog Ch.\n Name","Analog Ch.\nNumber"]
["Ω","VREF","Pin56","AN0 ",0,"+","0.1Ω"]
["kΩ","电压通道","Pin55","AN1 ",1,"-","1Ω"]
[null,"固定电压","Pin54","AN2 ",2,null,"10Ω"]
[null,null,"Pin53","AN3",3,null,"100Ω"]
[null,null,"Pin52","AN4",4]
[null,null,"Pin51","AN5",5]
[null,null,"Pin50","AN6",6]
[null,null,"Pin49","AN7",7]
{"$rows_left_out":9}
{"sheet":"Summary","index":6,"n_rows":312,"n_cols":21,"rows_kept":312,"cut":false,"hidden":false,"merged":[]}
["Channel","Enable","Channel Name","Pin Index","AN","Reference Type","Reference","Output Unit","R1 Unit Index","R1","R2 Available","R2 Unit Index","R2","R4 Unit Index","R4","R5 Unit Index","R5","Cal. Enable","Cal. Select","Cal. Mode","Cal. Data"]
["V1_1",true,{"$f":"IF(LEN(电压测量通道!$G$5)>0,UPPER(电压测量通道!$G$5),\"\")","v":"ADC_CH_KL30_VOLTAGE"},3,{"$f":"INDEX(Parameters!$E$3:$E$18,$D2)","v":2},0,"-",1,2,{"$f":"INT(电压测量通道!$M$14*IF($I2=2,10000,10))","v":3300000},true,2,{"$f":"INT(电压测量通道!$M$24*IF($L2=2,10000,10))","v":1000000},"-","-","-","-",false,1,{"$f":"IF($R2=TRUE,$S2,0)","v":0},{"$f":"INT(电压测量通道!$V$24)","v":0}]
["V1_2",false,{"$f":"IF(LEN(电压测量通道!$G$32)>0,UPPER(电压测量通道!$G$32),\"\")","v":"ADC_CH_AIR_BAG_LED"},1,{"$f":"INDEX(Parameters!$E$3:$E$18,$D3)","v":0},0,"-",1,1,{"$f":"INT(电压测量通道!$M$41*IF($I3=2,10000,10))","v":0},false,2,{"$f":"INT(电压测量通道!$M$51*IF($L3=2,10000,10))","v":100000},"-","-","-","-",false,1,{"$f":"IF($R3=TRUE,$S3,0)","v":0},{"$f":"INT(电压测量通道!$V$51)","v":0}]
["V1_3",true,{"$f":"IF(LEN(电压测量通道!$G$59)>0,UPPER(电压测量通道!$G$59),\"\")","v":"ADC_CH_KL15_VOLTAGE"},4,{"$f":"INDEX(Parameters!$E$3:$E$18,$D4)","v":3},0,"-",1,2,{"$f":"INT(电压测量通道!$M$68*IF($I4=2,10000,10))","v":3300000},true,2,{"$f":"INT(电压测量通道!$M$78*IF($L4=2,10000,10))","v":1000000},"-","-","-","-",false,1,0,{"$f":"INT(电压测量通道!$V$78)","v":0}]
["V1_4",true,{"$f":"IF(LEN(电压测量通道!$G$86)>0,UPPER(电压测量通道!$G$86),\"\")","v":"ADC_CH_FUEL_VREF"},8,{"$f":"INDEX(Parameters!$E$3:$E$18,$D5)","v":7},0,"-",1,2,{"$f":"INT(电压测量通道!$M$95*IF($I5=2,10000,10))","v":0},false,2,{"$f":"INT(电压测量通道!$M$105*IF($L5=2,10000,10))","v":0},"-","-","-","-",false,1,0,{"$f":"INT(电压测量通道!$V$105)","v":0}]
["V1_5",false,{"$f":"IF(LEN(电压测量通道!$G$113)>0,UPPER(电压测量通道!$G$113),\"\")","v":"ADC_CH_FUEL1"},6,{"$f":"INDEX(Parameters!$E$3:$E$18,$D6)","v":5},0,"-",1,2,{"$f":"INT(电压测量通道!$M$122*IF($I6=2,10000,10))","v":270000},true,2,{"$f":"INT(电压测量通道!$M$132*IF($L6=2,10000,10))","v":180000},"-","-","-","-",false,1,0,{"$f":"INT(电压测量通道!$V$132)","v":0}]
["V1_6",false,{"$f":"IF(LEN(电压测量通道!$G$140)>0,UPPER(电压测量通道!$G$140),\"\")","v":"ADC_CH_GEAR"},7,{"$f":"INDEX(Parameters!$E$3:$E$18,$D7)","v":6},0,"-",1,1,{"$f":"INT(电压测量通道!$M$149*IF($I7=2,10000,10))","v":0},false,2,{"$f":"INT(电压测量通道!$M$159*IF($L7=2,10000,10))","v":3000000},"-","-","-","-",false,1,0,{"$f":"INT(电压测量通道!$V$159)","v":0}]
["V1_7",false,{"$f":"IF(LEN(电压测量通道!$G$167)>0,UPPER(电压测量通道!$G$167),\"\")","v":"ADCH_TEST"},8,{"$f":"INDEX(Parameters!$E$3:$E$18,$D8)","v":7},0,"-",1,2,{"$f":"INT(电压测量通道!$M$176*IF($I8=2,10000,10))","v":270000},true,2,{"$f":"INT(电压测量通道!$M$186*IF($L8=2,10000,10))","v":180000},"-","-","-","-",false,1,0,{"$f":"INT(电压测量通道!$V$186)","v":0}]
["V1_8",false,{"$f":"IF(LEN(电压测量通道!$G$194)>0,UPPER(电压测量通道!$G$194),\"\")","v":""},1,{"$f":"INDEX(Parameters!$E$3:$E$18,$D9)","v":0},0,"-",1,2,{"$f":"INT(电压测量通道!$M$203*IF($I9=2,10000,10))","v":330000},true,2,{"$f":"INT(电压测量通道!$M$213*IF($L9=2,10000,10))","v":100000},"-","-","-","-",false,1,0,{"$f":"INT(电压测量通道!$V$213)","v":0}]
["V1_9",false,{"$f":"IF(LEN(电压测量通道!$G$221)>0,UPPER(电压测量通道!$G$221),\"\")","v":""},1,{"$f":"INDEX(Parameters!$E$3:$E$18,$D10)","v":0},0,"-",1,2,{"$f":"INT(电压测量通道!$M$230*IF($I10=2,10000,10))","v":330000},true,2,{"$f":"INT(电压测量通道!$M$240*IF($L10=2,10000,10))","v":100000},"-","-","-","-",false,1,0,{"$f":"INT(电压测量通道!$V$240)","v":0}]
{"$rows_left_out":34}
{"sheet":"Global_Config","index":7,"n_rows":12,"n_cols":3,"rows_kept":12,"cut":false,"hidden":false,"merged":[]}
["Item","Configuration","Note"]
["Version","1.1.0"]
["MCU part number","BAT32G137"]
["VREF",{"$f":"INT(封面!$C$16*1000)","v":5000},"Linke to cover page, do not modify"]
["Internal reference voltage",0,"Unit: mV"]
["Internal reference voltage channel",0]
["Calibrate VREF using internal reference voltage",0,"0 - N / 1 - Y"]
["Conversion service call cycle",{"$f":"INT(封面!$C$17)","v":2},"Linke to cover page, do not modify"]
["Maximum sample interval",{"$f":"INT(封面!$C$18)","v":10},"Linke to cover page, do not modify"]
["Power up debounce duration",{"$f":"INT(封面!$C$19)","v":10},"Linke to cover page, do not modify"]
{"$rows_left_out":2}