{"text_format":"2","workbook":"xlsx","n_sheets":5,"sheets":["GPIO Configuration","Output Functions","Input Level","Output Drive Capacity","Configuration Export"],"not_rendered":{"charts":0,"images":1,"macros":1,"external_links":0,"defined_names":379,"comments":0,"pivot_tables":0},"unopened":[],"bounds":{"document_bytes":16777216,"sheet_cells":100000,"run_cost":"one","rows_first":2000,"rows_last":500,"rows_between":2000,"halvings":0,"cell_chars":16384,"cell_head_chars":4096},"cells_cut":0,"cells_raw":0,"read":"whole","date_system":"1900"}

{"sheet":"GPIO Configuration","index":0,"n_rows":101,"n_cols":20,"rows_kept":101,"cut":false,"hidden":false,"merged":[[0,0,0,3],[0,4,0,17],[1,4,1,11],[1,12,1,19],[1,0,2,0],[1,1,2,1],[1,2,2,2],[1,3,2,3]]}
[{"$nulls":4},"通用输入输出端口配置",{"$nulls":13},"Ver:","1.0.0"]
["引脚编号","端口编号","端口映射","端口映射名称","运行状态",{"$nulls":7},"休眠状态"]
[{"$nulls":4},"端口方向","默认输出电平","输出功能选择","输出驱动能力","上/下拉选择","输入电平选择","输入使能","输入滤波使能","端口方向","默认输出电平","输出功能选择","输出驱动能力","上/下拉选择","输入电平选择","输入使能","输入滤波使能"]
[2,"P0_00","否",null,"OUT - 输出","0 - 低电平","GPIO","5mA","无","CMOS-hys ","0 - 禁止","1 - 使能","OUT - 输出","0 - 低电平","GPIO","1mA ","无","CMOS-hys ","0 - 禁止","1 - 使能"]
[3,"P0_01","否",null,"OUT - 输出","0 - 低电平","GPIO","5mA","无","CMOS-hys ","0 - 禁止","1 - 使能","OUT - 输出","0 - 低电平","GPIO","1mA ","无","CMOS-hys ","0 - 禁止","1 - 使能"]
[4,"P0_02","否",null,"OUT - 输出","0 - 低电平","GPIO","5mA","无","CMOS-hys ","0 - 禁止","1 - 使能","OUT - 输出","0 - 低电平","GPIO","1mA ","无","CMOS-hys ","0 - 禁止","1 - 使能"]
[5,"P0_03","否",null,"OUT - 输出","0 - 低电平","GPIO","5mA","无","CMOS-hys ","0 - 禁止","1 - 使能","OUT - 输出","0 - 低电平","GPIO","1mA ","无","CMOS-hys ","0 - 禁止","1 - 使能"]
[6,"P0_04","否",null,"OUT - 输出","0 - 低电平","GPIO","5mA","无","CMOS-hys ","0 - 禁止","1 - 使能","OUT - 输出","0 - 低电平","GPIO","1mA ","无","CMOS-hys ","0 - 禁止","1 - 使能"]
[7,"P0_05","否",null,"OUT - 输出","1 - 高电平","GPIO","5mA","无","CMOS-hys ","0 - 禁止","1 - 使能","OUT - 输出","0 - 低电平","GPIO","1mA ","无","CMOS-hys ","0 - 禁止","1 - 使能"]
[8,"P0_06","是","Sensor_5V_OUT","OUT - 输出","0 - 低电平","GPIO","5mA","无","CMOS-hys ","0 - 禁止","1 - 使能","OUT - 输出","1 - 高电平","GPIO","1mA ","无","CMOS-hys ","0 - 禁止","1 - 使能"]
[11,"P0_07","否",null,"OUT - 输出","0 - 低电平","GPIO","5mA","无","CMOS-hys ","0 - 禁止","1 - 使能","OUT - 输出","0 - 低电平","GPIO","1mA ","无","CMOS-hys ","0 - 禁止","1 - 使能"]
[12,"P0_08","否",null,"OUT - 输出","0 - 低电平","GPIO","5mA","无","CMOS-hys ","0 - 禁止","1 - 使能","OUT - 输出","0 - 低电平","GPIO","1mA ","无","CMOS-hys ","0 - 禁止","1 - 使能"]
[13,"P0_09","否",null,"IN - 输入","0 - 低电平","GPIO","5mA","无","CMOS-hys ","1 - 使能","1 - 使能","IN - 输入","0 - 低电平","GPIO","1mA ","无","CMOS-hys ","0 - 禁止","1 - 使能"]
[14,"P0_10","是","Line_In_Bluetooth","IN - 输入","0 - 低电平","GPIO","5mA","无","CMOS-hys ","1 - 使能","1 - 使能","IN - 输入","0 - 低电平","GPIO","1mA ","无","CMOS-hys ","0 - 禁止","1 - 使能"]
[15,"P0_11","是","Line_In_BrakeFluid","IN - 输入","0 - 低电平","GPIO","5mA","无","CMOS-hys ","1 - 使能","1 - 使能","IN - 输入","0 - 低电平","GPIO","1mA ","无","CMOS-hys ","0 - 禁止","1 - 使能"]
[16,"P0_12","是","LightingInput_OUT","OUT - 输出","1 - 高电平","GPIO","5mA","无","CMOS-hys ","0 - 禁止","1 - 使能","OUT - 输出","0 - 低电平","GPIO","1mA ","无","CMOS-hys ","0 - 禁止","1 - 使能"]
[19,"P0_13","是","Line_In_OTA_Switch","IN - 输入","0 - 低电平","GPIO","5mA ","无","CMOS-hys ","1 - 使能","1 - 使能","IN - 输入","0 - 低电平","GPIO","1mA ","无","CMOS-hys ","0 - 禁止","1 - 使能"]
[20,"P0_14","是","Line_In_TRIP_Switch","IN - 输入","0 - 低电平","GPIO","5mA ","无","CMOS-hys ","1 - 使能","1 - 使能","IN - 输入","0 - 低电平","GPIO","1mA ","无","CMOS-hys ","0 - 禁止","1 - 使能"]
[21,"P0_15","是","Line_In_SEATBELT_DR","IN - 输入","0 - 低电平","GPIO","5mA ","无","CMOS-hys ","1 - 使能","1 - 使能","IN - 输入","0 - 低电平","GPIO","1mA ","无","CMOS-hys ","0 - 禁止","1 - 使能"]
[22,"P0_16","否",null,"OUT - 输出","0 - 低电平","GPIO","15mA","无","CMOS-hys ","0 - 禁止","1 - 使能","OUT - 输出","0 - 低电平","GPIO","1mA ","无","CMOS-hys ","0 - 禁止","1 - 使能"]
[23,"P0_17","否",null,"OUT - 输出","0 - 低电平","GPIO","15mA","无","CMOS-hys ","0 - 禁止","1 - 使能","OUT - 输出","0 - 低电平","GPIO","1mA ","无","CMOS-hys ","0 - 禁止","1 - 使能"]
[26,"P0_18","是","Line_In_TurnRight","IN - 输入","0 - 低电平","GPIO","5mA ","无","CMOS-hys ","1 - 使能","1 - 使能","IN - 输入","0 - 低电平","GPIO","1mA ","无","CMOS-hys ","1 - 使能","1 - 使能"]
[28,"P0_19","是","Line_In_Hbeam","IN - 输入","0 - 低电平","GPIO","5mA ","无","CMOS-hys ","1 - 使能","1 - 使能","IN - 输入","0 - 低电平","GPIO","1mA ","无","CMOS-hys ","0 - 禁止","1 - 使能"]
[29,"P0_20","是","Line_In_Lbeam","IN - 输入","0 - 低电平","GPIO","5mA ","无","CMOS-hys ","1 - 使能","1 - 使能","IN - 输入","0 - 低电平","GPIO","1mA ","无","CMOS-hys ","0 - 禁止","1 - 使能"]
[30,"P0_21","是","Line_In_Position","IN - 输入","0 - 低电平","GPIO","5mA ","无","CMOS-hys ","1 - 使能","1 - 使能","IN - 输入","0 - 低电平","GPIO","1mA ","无","CMOS-hys ","0 - 禁止","1 - 使能"]
[31,"P0_22","是","Line_In_RearFog","IN - 输入","0 - 低电平","GPIO","5mA ","无","CMOS-hys ","1 - 使能","1 - 使能","IN - 输入","0 - 低电平","GPIO","1mA ","无","CMOS-hys ","0 - 禁止","1 - 使能"]
[32,"P0_23","是","Line_In_Daylight","IN - 输入","0 - 低电平","GPIO","5mA ","无","CMOS-hys ","1 - 使能","1 - 使能","IN - 输入","0 - 低电平","GPIO","1mA ","无","CMOS-hys ","0 - 禁止","1 - 使能"]
[35,"P0_24","是","Line_In_Handbrake","IN - 输入","0 - 低电平","GPIO","5mA ","无","CMOS-hys ","1 - 使能","1 - 使能","IN - 输入","0 - 低电平","GPIO","1mA ","无","CMOS-hys ","0 - 禁止","1 - 使能"]
[50,"P0_25","否","CAN0_RX","IN - 输入","1 - 高电平","GPIO","5mA","无","CMOS-hys ","1 - 使能","0 - 禁止","IN - 输入","1 - 高电平","GPIO","1mA ","无","CMOS-hys ","0 - 禁止","0 - 禁止"]
[51,"P0_26","否","CAN0_TX","OUT - 输出","1 - 高电平","CAN0_TX_0","5mA","无","CMOS-hys ","0 - 禁止","1 - 使能","OUT - 输出","1 - 高电平","CAN0_TX_0","1mA ","无","CMOS-hys ","0 - 禁止","1 - 使能"]
[52,"P0_27","否",null,"IN - 输入","0 - 低电平","GPIO","5mA","无","CMOS-hys ","1 - 使能","0 - 禁止","IN - 输入","0 - 低电平","GPIO","1mA ","无","CMOS-hys ","0 - 禁止","1 - 使能"]
[53,"P0_28","是","DimmerSwitch_AD","IN - 输入","0 - 低电平","GPIO","5mA","无","CMOS-hys ","1 - 使能","1 - 使能","IN - 输入","0 - 低电平","GPIO","1mA ","无","CMOS-hys ","0 - 禁止","1 - 使能"]
[54,"P0_29","是","CAN0_STB","OUT - 输出","1 - 高电平","GPIO","5mA","无","CMOS-hys ","0 - 禁止","1 - 使能","OUT - 输出","1 - 高电平","GPIO","1mA ","无","CMOS-hys ","0 - 禁止","1 - 使能"]
[56,"P0_30","否",null,"IN - 输入","0 - 低电平","GPIO","5mA","无","CMOS-hys ","0 - 禁止","1 - 使能","IN - 输入","0 - 低电平","GPIO","1mA ","无","CMOS-hys ","0 - 禁止","1 - 使能"]
[57,"P0_31","否",null,"IN - 输入","0 - 低电平","GPIO","5mA","无","CMOS-hys ","0 - 禁止","1 - 使能","IN - 输入","0 - 低电平","GPIO","1mA ","无","CMOS-hys ","0 - 禁止","1 - 使能"]
[60,"P1_00","否",null,"IN - 输入","0 - 低电平","GPIO","5mA","无","CMOS-hys ","1 - 使能","0 - 禁止","OUT - 输出","0 - 低电平","GPIO","1mA ","无","CMOS-hys ","1 - 使能","0 - 禁止"]
[61,"P1_01","否",null,"IN - 输入","0 - 低电平","GPIO","5mA","无","CMOS-hys ","1 - 使能","0 - 禁止","OUT - 输出","0 - 低电平","GPIO","1mA ","无","CMOS-hys ","0 - 禁止","1 - 使能"]
[62,"P1_02","是","Line_In_SOC_CC","IN - 输入","0 - 低电平","GPIO","5mA","无","CMOS-hys ","1 - 使能","1 - 使能","IN - 输入","0 - 低电平","GPIO","1mA ","无","CMOS-hys ","1 - 使能","1 - 使能"]
[63,"P1_03","否","NTC_IN","IN - 输入","0 - 低电平","GPIO","5mA","无","CMOS-hys ","1 - 使能","0 - 禁止","IN - 输入","0 - 低电平","GPIO","1mA ","无","CMOS-hys ","0 - 禁止","1 - 使能"]
[64,"P1_04","是","LED_DRIVER_EN","OUT - 输出","0 - 低电平","GPIO","5mA","无","CMOS-hys ","0 - 禁止","1 - 使能","IN - 输入","0 - 低电平","GPIO","1mA ","无","CMOS-hys ","1 - 使能","1 - 使能"]
[65,"P1_05","是","SDA_LED_DRIVER","OUT - 输出","0 - 低电平","GPIO","5mA","无","CMOS-hys ","1 - 使能","1 - 使能","OUT - 输出","1 - 高电平","GPIO","1mA ","无","CMOS-hys ","0 - 禁止","1 - 使能"]
[66,"P1_06","是","SCL_LED_DRIVER","OUT - 输出","0 - 低电平","GPIO","5mA","无","CMOS-hys ","0 - 禁止","1 - 使能","OUT - 输出","1 - 高电平","GPIO","1mA ","无","CMOS-hys ","1 - 使能","1 - 使能"]
[67,"P1_07","是","Line_In_DoorOpen","IN - 输入","0 - 低电平","GPIO","5mA","无","CMOS-hys ","1 - 使能","1 - 使能","IN - 输入","0 - 低电平","GPIO","1mA ","无","CMOS-hys ","1 - 使能","1 - 使能"]
[74,"P1_08","是","MCU_EEPROM_SCL","OUT - 输出","0 - 低电平","GPIO","5mA","无","CMOS-hys ","1 - 使能","1 - 使能","OUT - 输出","1 - 高电平","GPIO","1mA ","无","CMOS-hys ","0 - 禁止","1 - 使能"]
[77,"P1_09","是","MCU_EEPROM_SDA","OUT - 输出","0 - 低电平","GPIO","5mA","无","CMOS-hys ","1 - 使能","1 - 使能","OUT - 输出","1 - 高电平","GPIO","1mA ","无","CMOS-hys ","0 - 禁止","1 - 使能"]
[80,"P1_10","是","GPIO_KL15","IN - 输入","0 - 低电平","GPIO","30mA","无","CMOS-hys ","1 - 使能","1 - 使能","IN - 输入","0 - 低电平","GPIO","1mA ","无","CMOS-hys ","1 - 使能","1 - 使能"]
[81,"P1_11","是","SD_MODE_MCU","OUT - 输出","0 - 低电平","GPIO","30mA","无","CMOS-hys ","0 - 禁止","1 - 使能","OUT - 输出","0 - 低电平","GPIO","1mA ","无","CMOS-hys ","1 - 使能","0 - 禁止"]
[82,"P1_12","是","FM_MODE_MCU","OUT - 输出","0 - 低电平","BT7_TIOA14_0","30mA","无","CMOS-hys ","0 - 禁止","1 - 使能","OUT - 输出","0 - 低电平","GPIO","1mA ","无","CMOS-hys ","1 - 使能","0 - 禁止"]
[83,"P1_13","否","KL_30_AD","IN - 输入","0 - 低电平","GPIO","30mA","无","CMOS-hys ","1 - 使能","0 - 禁止","IN - 输入","0 - 低电平","GPIO","1mA ","无","CMOS-hys ","1 - 使能","0 - 禁止"]
[84,"P1_14","否",null,"IN - 输入","0 - 低电平","GPIO","30mA","无","CMOS-hys ","1 - 使能","0 - 禁止","IN - 输入","0 - 低电平","GPIO","1mA ","无","CMOS-hys ","1 - 使能","0 - 禁止"]
[85,"P1_15","是","PW_OUT","OUT - 输出","0 - 低电平","BT8_TIOA17_0","30mA","无","CMOS-hys ","0 - 禁止","1 - 使能","OUT - 输出","0 - 低电平","GPIO","1mA ","无","CMOS-hys ","1 - 使能","0 - 禁止"]
[86,"P1_16","是","PW1_OUT","OUT - 输出","0 - 低电平","BT9_TIOA18_0","30mA","无","CMOS-hys ","0 - 禁止","1 - 使能","OUT - 输出","0 - 低电平","GPIO","1mA ","无","CMOS-hys ","1 - 使能","0 - 禁止"]
[87,"P1_17","否","KL_15_AD","IN - 输入","0 - 低电平","GPIO","30mA","无","CMOS-hys ","1 - 使能","0 - 禁止","IN - 输入","0 - 低电平","GPIO","1mA ","无","CMOS-hys ","0 - 禁止","1 - 使能"]
[90,"P1_18","否",null,"OUT - 输出","0 - 低电平","GPIO","30mA","无","CMOS-hys ","0 - 禁止","1 - 使能","IN - 输入","0 - 低电平","GPIO","1mA ","无","CMOS-hys ","0 - 禁止","1 - 使能"]
[91,"P1_19","是","Line_In_TurnLeft","IN - 输入","0 - 低电平","GPIO","5mA ","无","CMOS-hys ","1 - 使能","1 - 使能","IN - 输入","0 - 低电平","GPIO","1mA ","无","CMOS-hys ","1 - 使能","1 - 使能"]
[92,"P1_20","否",null,"OUT - 输出","0 - 低电平","GPIO","30mA","无","CMOS-hys ","0 - 禁止","1 - 使能","IN - 输入","0 - 低电平","GPIO","1mA ","无","CMOS-hys ","0 - 禁止","1 - 使能"]
[93,"P1_21","否",null,"OUT - 输出","0 - 低电平","GPIO","30mA","无","CMOS-hys ","0 - 禁止","1 - 使能","IN - 输入","0 - 低电平","GPIO","1mA ","无","CMOS-hys ","0 - 禁止","1 - 使能"]
[94,"P1_22","否",null,"OUT - 输出","0 - 低电平","GPIO","30mA","无","CMOS-hys ","0 - 禁止","1 - 使能","IN - 输入","0 - 低电平","GPIO","1mA ","无","CMOS-hys ","0 - 禁止","1 - 使能"]
[95,"P1_23","是","CSB1_OUT","OUT - 输出","0 - 低电平","GPIO","30mA","无","CMOS-hys ","0 - 禁止","1 - 使能","IN - 输入","0 - 低电平","GPIO","1mA ","无","CMOS-hys ","0 - 禁止","1 - 使能"]
[96,"P1_24","是","SCL1_OUT","OUT - 输出","0 - 低电平","GPIO","30mA","无","CMOS-hys ","0 - 禁止","1 - 使能","IN - 输入","0 - 低电平","GPIO","1mA ","无","CMOS-hys ","0 - 禁止","1 - 使能"]
[97,"P1_25","是","SD1_OUT","OUT - 输出","0 - 低电平","GPIO","30mA","无","CMOS-hys ","0 - 禁止","1 - 使能","IN - 输入","0 - 低电平","GPIO","1mA ","无","CMOS-hys ","0 - 禁止","1 - 使能"]
[100,"P1_26","是","CSB0_OUT","OUT - 输出","0 - 低电平","GPIO","30mA","无","CMOS-hys ","0 - 禁止","0 - 禁止","IN - 输入","0 - 低电平","GPIO","1mA ","无","CMOS-hys ","1 - 使能","0 - 禁止"]
[101,"P1_27","是","SCL0_OUT","OUT - 输出","0 - 低电平","GPIO","30mA","无","CMOS-hys ","0 - 禁止","1 - 使能","IN - 输入","0 - 低电平","GPIO","1mA ","无","CMOS-hys ","0 - 禁止","1 - 使能"]
[102,"P1_28","是","SD0_OUT","OUT - 输出","0 - 低电平","GPIO","30mA","无","CMOS-hys ","0 - 禁止","1 - 使能","IN - 输入","0 - 低电平","GPIO","1mA ","无","CMOS-hys ","0 - 禁止","1 - 使能"]
[103,"P1_29","是","CSB_OUT","OUT - 输出","0 - 低电平","GPIO","30mA","无","CMOS-hys ","0 - 禁止","1 - 使能","IN - 输入","0 - 低电平","GPIO","1mA ","无","CMOS-hys ","0 - 禁止","1 - 使能"]
[104,"P1_30","是","SCL_OUT","OUT - 输出","0 - 低电平","GPIO","30mA","无","CMOS-hys ","0 - 禁止","1 - 使能","OUT - 输出","0 - 低电平","GPIO","1mA ","无","CMOS-hys ","0 - 禁止","1 - 使能"]
[105,"P1_31","是","SD_OUT","OUT - 输出","0 - 低电平","GPIO","30mA","无","CMOS-hys ","0 - 禁止","1 - 使能","OUT - 输出","0 - 低电平","GPIO","1mA ","无","CMOS-hys ","0 - 禁止","1 - 使能"]
[106,"P2_00","否",null,"IN - 输入","0 - 低电平","GPIO","30mA","无","CMOS-hys ","1 - 使能","1 - 使能","IN - 输入","0 - 低电平","GPIO","1mA ","无","CMOS-hys ","0 - 禁止","1 - 使能"]
[107,"P2_01","否",null,"OUT - 输出","1 - 高电平","GPIO","30mA","无","CMOS-hys ","0 - 禁止","1 - 使能","OUT - 输出","0 - 低电平","GPIO","1mA ","无","CMOS-hys ","0 - 禁止","1 - 使能"]
[112,"P2_02","否",null,"IN - 输入","0 - 低电平","GPIO","- ","无","CMOS-hys ","0 - 禁止","1 - 使能","IN - 输入","0 - 低电平","GPIO","- ","无","CMOS-hys ","0 - 禁止","1 - 使能"]
[113,"P2_03","是","Power_5V_EN","OUT - 输出","1 - 高电平","GPIO","5mA","无","CMOS-hys ","0 - 禁止","1 - 使能","OUT - 输出","0 - 低电平","GPIO","1mA ","无","CMOS-hys ","0 - 禁止","1 - 使能"]
[114,"P2_04","否",null,"OUT - 输出","0 - 低电平","GPIO","5mA","无","CMOS-hys ","0 - 禁止","1 - 使能","OUT - 输出","0 - 低电平","GPIO","1mA ","无","CMOS-hys ","0 - 禁止","1 - 使能"]
[115,"P2_05","否",null,"OUT - 输出","0 - 低电平","GPIO","5mA","无","CMOS-hys ","0 - 禁止","1 - 使能","OUT - 输出","0 - 低电平","GPIO","1mA ","无","CMOS-hys ","0 - 禁止","1 - 使能"]
[116,"P2_06","否",null,"OUT - 输出","0 - 低电平","GPIO","5mA","无","CMOS-hys ","0 - 禁止","1 - 使能","OUT - 输出","0 - 低电平","GPIO","1mA ","无","CMOS-hys ","0 - 禁止","1 - 使能"]
[117,"P2_07","否",null,"OUT - 输出","0 - 低电平","GPIO","5mA","无","CMOS-hys ","0 - 禁止","1 - 使能","OUT - 输出","0 - 低电平","GPIO","1mA ","无","CMOS-hys ","0 - 禁止","1 - 使能"]
[118,"P2_08","是",null,"OUT - 输出","0 - 低电平","GPIO","5mA","无","CMOS-hys ","0 - 禁止","1 - 使能","OUT - 输出","0 - 低电平","GPIO","1mA ","无","CMOS-hys ","0 - 禁止","1 - 使能"]
[121,"P2_09","否",null,"OUT - 输出","0 - 低电平","GPIO","5mA","无","CMOS-hys ","0 - 禁止","0 - 禁止","OUT - 输出","0 - 低电平","GPIO","1mA ","无","CMOS-hys ","0 - 禁止","1 - 使能"]
[122,"P2_10","否",null,"OUT - 输出","0 - 低电平","GPIO","5mA","无","CMOS-hys ","0 - 禁止","0 - 禁止","OUT - 输出","0 - 低电平","GPIO","1mA ","无","CMOS-hys ","0 - 禁止","1 - 使能"]
[123,"P2_11","否",null,"OUT - 输出","1 - 高电平","GPIO","5mA","无","CMOS-hys ","0 - 禁止","0 - 禁止","OUT - 输出","0 - 低电平","GPIO","1mA ","无","CMOS-hys ","0 - 禁止","1 - 使能"]
[124,"P2_12","否",null,"OUT - 输出","0 - 低电平","GPIO","5mA","无","CMOS-hys ","0 - 禁止","0 - 禁止","OUT - 输出","0 - 低电平","GPIO","1mA ","无","CMOS-hys ","0 - 禁止","1 - 使能"]
[125,"P2_13","否",null,"OUT - 输出","0 - 低电平","GPIO","5mA","无","CMOS-hys ","0 - 禁止","0 - 禁止","OUT - 输出","0 - 低电平","GPIO","1mA ","无","CMOS-hys ","0 - 禁止","1 - 使能"]
[126,"P2_14","否",null,"OUT - 输出","1 - 高电平","GPIO","5mA","无","CMOS-hys ","0 - 禁止","1 - 使能","OUT - 输出","0 - 低电平","GPIO","1mA ","无","CMOS-hys ","0 - 禁止","1 - 使能"]
[127,"P2_15","否",null,"OUT - 输出","1 - 高电平","GPIO","5mA","无","CMOS-hys ","0 - 禁止","1 - 使能","OUT - 输出","0 - 低电平","GPIO","1mA ","无","CMOS-hys ","0 - 禁止","1 - 使能"]
[128,"P2_16","否",null,"OUT - 输出","1 - 高电平","GPIO","5mA","无","CMOS-hys ","0 - 禁止","1 - 使能","OUT - 输出","0 - 低电平","GPIO","1mA ","无","CMOS-hys ","0 - 禁止","1 - 使能"]
[129,"P2_17","否",null,"OUT - 输出","1 - 高电平","GPIO","5mA","无","CMOS-hys ","0 - 禁止","1 - 使能","OUT - 输出","0 - 低电平","GPIO","1mA ","无","CMOS-hys ","0 - 禁止","1 - 使能"]
[130,"P2_18","否",null,"OUT - 输出","1 - 高电平","GPIO","5mA","无","CMOS-hys ","0 - 禁止","1 - 使能","OUT - 输出","0 - 低电平","GPIO","1mA ","无","CMOS-hys ","0 - 禁止","1 - 使能"]
[131,"P2_19","否",null,"OUT - 输出","0 - 低电平","GPIO","5mA","无","CMOS-hys ","0 - 禁止","1 - 使能","OUT - 输出","0 - 低电平","GPIO","1mA ","无","CMOS-hys ","0 - 禁止","1 - 使能"]
[132,"P2_20","否",null,"OUT - 输出","0 - 低电平","GPIO","5mA","无","CMOS-hys ","0 - 禁止","1 - 使能","OUT - 输出","0 - 低电平","GPIO","1mA ","无","CMOS-hys ","0 - 禁止","1 - 使能"]
[133,"P2_21","否",null,"OUT - 输出","0 - 低电平","GPIO","5mA","无","CMOS-hys ","0 - 禁止","1 - 使能","OUT - 输出","0 - 低电平","GPIO","1mA ","无","CMOS-hys ","0 - 禁止","1 - 使能"]
[136,"P2_22","是","RADA5V_EN","OUT - 输出","1 - 高电平","GPIO","5mA","无","CMOS-hys ","0 - 禁止","1 - 使能","OUT - 输出","1 - 高电平","GPIO","1mA ","无","CMOS-hys ","0 - 禁止","1 - 使能"]
[137,"P2_23","是","RADA_TX","OUT - 输出","1 - 高电平","MFS1_SOT_0","5mA","无","CMOS-hys ","0 - 禁止","0 - 禁止","OUT - 输出","0 - 低电平","GPIO","1mA ","无","CMOS-hys ","0 - 禁止","1 - 使能"]
[138,"P2_24","否",null,"IN - 输入","0 - 低电平","GPIO","5mA","无","CMOS-hys ","1 - 使能","1 - 使能","IN - 输入","0 - 低电平","GPIO","1mA ","无","CMOS-hys ","1 - 使能","1 - 使能"]
[139,"P2_25","是","RADA_RX","IN - 输入","1 - 高电平","GPIO","5mA","无","CMOS-hys ","1 - 使能","0 - 禁止","OUT - 输出","0 - 低电平","GPIO","1mA ","无","CMOS-hys ","0 - 禁止","1 - 使能"]
[140,"P2_26","否",null,"IN - 输入","0 - 低电平","GPIO","5mA","无","CMOS-hys ","1 - 使能","1 - 使能","IN - 输入","0 - 低电平","GPIO","1mA ","无","CMOS-hys ","0 - 禁止","1 - 使能"]
[141,"P2_27","否",null,"OUT - 输出","1 - 高电平","GPIO","5mA","无","CMOS-hys ","0 - 禁止","1 - 使能","OUT - 输出","0 - 低电平","GPIO","1mA ","无","CMOS-hys ","0 - 禁止","1 - 使能"]
[142,"P2_28","否",null,"OUT - 输出","0 - 低电平","GPIO","5mA","无","CMOS-hys ","0 - 禁止","1 - 使能","OUT - 输出","0 - 低电平","GPIO","1mA ","无","CMOS-hys ","0 - 禁止","1 - 使能"]
[143,"P2_29","否",null,"IN - 输入","0 - 低电平","GPIO","5mA","无","CMOS-hys ","1 - 使能","0 - 禁止","OUT - 输出","0 - 低电平","GPIO","1mA ","无","CMOS-hys ","0 - 禁止","1 - 使能"]
[]
[null,null,"是",null,"IN - 输入","0 - 低电平",null,null,"无",null,"0 - 禁止","0 - 禁止","IN - 输入","0 - 低电平",null,null,"无",null,"0 - 禁止","0 - 禁止"]
[null,null,"否",null,"OUT - 输出","1 - 高电平",null,null,"上拉",null,"1 - 使能","1 - 使能","OUT - 输出","1 - 高电平",null,null,"上拉",null,"1 - 使能","1 - 使能"]
[{"$nulls":8},"下拉",{"$nulls":7},"下拉"]

{"sheet":"Output Functions","index":1,"n_rows":129,"n_cols":11,"rows_kept":129,"cut":false,"hidden":false,"merged":[[0,0,0,10],[1,3,1,10],[1,0,2,0],[1,1,2,1],[1,2,2,2]]}
["Port Output Function Configuration"]
["Register","Offset","Port","Resource Functional Outputs"]
[null,null,null,"POF=0 ","POF=1 ","POF=2 ","POF=3 ","POF=4 ","POF=5 ","POF=6 ","POF=7"]
["PPC_PCFGR000","0x0000","P0_00","GPIO","- ","LCDD12","MFS7_SOT_1","I2S1_SD_0 ","-","BT0_TIOA1_1","MAD8"]
["PPC_PCFGR001","0x0002","P0_01","GPIO","- ","LCDD13","MFS7_SCK_1","I2S1_WS_0","-","BT1_TIOA2_1","MAD9"]
["PPC_PCFGR002","0x0004","P0_02","GPIO","- ","LCDD14 ","-","I2S1_SCK_0","-","BT1_TIOA3_1","MAD10"]
["PPC_PCFGR003","0x0006","P0_03","GPIO","MFS1_SOT_1","LCDD15 ","- ","-","PCMP0_BL_1","BT2_TIOA4_1","MAD11"]
["PPC_PCFGR004","0x0008","P0_04","GPIO","MFS1_SCK_1","LCDD16 ","- ","I2S0_SD_0","PCMP0_BH_1","BT2_TIOA5_1","MAD12"]
["PPC_PCFGR005","0x000A","P0_05","GPIO","- ","LCDD17 ","-","I2S0_WS_0","PCMP0_AL_1","BT3_TIOA6_1","MAD13"]
["PPC_PCFGR006","0x000C","P0_06","GPIO","MFS1_CS0_1","CS# ","-","I2S0_SCK_0","PCMP0_AH_1","BT3_TIOA7_1","MAD14"]
["PPC_PCFGR007","0x000E","P0_07","GPIO","- ","WR# ","- ","- ","-","MFS4_SOT_1","MOEX"]
["PPC_PCFGR008","0x0010","P0_08","GPIO","- ","RD# ","- ","- ","-","MFS4_SCK_1","MWEX"]
["PPC_PCFGR009","0x0012","P0_09","GPIO","- ","- ","- ","-","PCMP1_BL_1","- ","MCLK"]
["PPC_PCFGR010","0x0014","P0_10","GPIO","- ","RS ","- ","-","PCMP1_BH_1","MFS4_CS0_1","MDQM0"]
["PPC_PCFGR011","0x0016","P0_11","GPIO","- ","RES# ","- ","-","PCMP1_AL_1","MFS4_CS1_1","MCSX2"]
["PPC_PCFGR012","0X0018","P0_12","GPIO","- ","- ","- ","-","PCMP1_AH_1","MFS4_CS2_1","MCSX3"]
["PPC_PCFGR013","0x001A","P0_13","GPIO","MFS2_SOT_0","DDRHSSPI1_SDATA0","- ","-","MFS9_SOT_2","- ","-"]
["PPC_PCFGR014","0x001C","P0_14","GPIO","MFS2_SCK_0","DDRHSSPI1_SDATA2","- ","-","MFS9_SCK_2","- ","-"]
["PPC_PCFGR015","0x001E","P0_15","GPIO","-","DDRHSSPI1_SDATA1","- ","- ","- ","- ","-"]
["PPC_PCFGR016","0x0020","P0_16","GPIO","MFS2_CS0_0","DDRHSSPI1_SSEL","- ","-","MFS9_CS0_2","- ","-"]
["PPC_PCFGR017","0x0022","P0_17","GPIO","MFS2_CS1_0","DDRHSSPI1_SDATA3","- ","-","MFS9_CS1_2","- ","-"]
["PPC_PCFGR018","0x0024","P0_18","GPIO","MFS2_CS2_0","DDRHSSPI0_SCLK","- ","- ","- ","- ","-"]
["PPC_PCFGR019","0x0026","P0_19","GPIO","MFS2_CS3_0","DDRHSSPI0_SDATA0","- ","-","MFS8_SOT_2","- ","-"]
["PPC_PCFGR020","0x0028","P0_20","GPIO","MFS3_SOT_0","DDRHSSPI0_SDATA2","- ","-","MFS8_SCK_2","- ","-"]
["PPC_PCFGR021","0x002A","P0_21","GPIO","MFS3_SCK_0","DDRHSSPI0_SDATA1","- ","- ","- ","- ","-"]
["PPC_PCFGR022","0x002C","P0_22","GPIO","-","DDRHSSPI0_SSEL","- ","-","MFS8_CS0_2","- ","-"]
["PPC_PCFGR023","0x002E","P0_23","GPIO","MFS3_CS0_0","DDRHSSPI0_SDATA3","- ","- ","- ","- ","-"]
["PPC_PCFGR024","0x0030","P0_24","GPIO","MFS3_CS1_0","- ","- ","- ","- ","- ","-"]
["PPC_PCFGR025","0x0032","P0_25","GPIO","MFS8_SOT_0","-","MFS0_SDA","OCU0_OUT0_0","-","BT0_TIOA0_0","PCMP0_BL_0"]
["PPC_PCFGR026","0x0034","P0_26","GPIO","MFS8_SCK_0","CAN0_TX_0","MFS0_SCL","OCU0_OUT1_0","RLT0_TOT_0","BT0_TIOA1_0","PCMP0_BH_0"]
["PPC_PCFGR027","0x0036","P0_27","GPIO","-","SG0_SGA_0","- ","- ","-","BT1_TIOA2_0","PCMP0_AL_0"]
["PPC_PCFGR028","0x0038","P0_28","GPIO","MFS8_CS0_0","SG0_SGO_0","CAN1_TX_0","PWUTRG_0","RLT1_TOT_0","BT1_TIOA3_0","PCMP0_AH_0"]
["PPC_PCFGR029","0x003A","P0_29","GPIO","MFS10_CS0_1","-","BT9_TIOA18_1","OCU8_OUT0_1","- ","- ","-"]
["PPC_PCFGR030","0x003C","P0_30","GPIO","MFS6_CS0_0","- ","-","OCU8_OUT0_0","-","BT4_TIOA8_0","-"]
["PPC_PCFGR031","0x003E","P0_31","GPIO","MFS6_CS1_0","- ","-","OCU8_OUT1_0","RLT17_TOT_0","BT4_TIOA9_0","-"]
["PPC_PCFGR100","0x0040","P1_00","GPIO","-","SG1_SGA_0","IND0_OUT_0","OCU1_OUT0_0","TRACE0_0","BT2_TIOA4_0","PCMP1_BL_0"]
["PPC_PCFGR101","0x0042","P1_01","GPIO","TRACE1_0","SG1_SGO_0","CAN2_TX_0","OCU1_OUT1_0","RLT16_TOT_0","BT2_TIOA5_0","PCMP1_BH_0"]
["PPC_PCFGR102","0x0044","P1_02","GPIO","MFS6_SOT_0","SG2_SGA_0","MFS6_SDA","OCU2_OUT0_0","TRACE2_0","BT3_TIOA6_0","PCMP1_AL_0"]
["PPC_PCFGR103","0x0046","P1_03","GPIO","MFS6_SCK_0","SG2_SGO_0","MFS6_SCL","OCU2_OUT1_0","TRACE3_0","BT3_TIOA7_0","PCMP1_AH_0"]
["PPC_PCFGR104","0x0048","P1_04","GPIO","-","SG3_SGA_0","BT9_TIOA19_1","OCU8_OUT1_1","RLT17_TOT_1","TRACE_CLK_0","-"]
["PPC_PCFGR105","0x004A","P1_05","GPIO","MFS7_SOT_0","SG3_SGO_0","-","OCU9_OUT0_1","TRACE_CTL_0","MFS7_SDA","-"]
["PPC_PCFGR106","0x004C","P1_06","GPIO","MFS7_SCK_0","SG4_SGA_0","CAN3_TX_0","OCU9_OUT1_1","RLT2_TOT_1","MFS7_SCL","-"]
["PPC_PCFGR107","0x004E","P1_07","GPIO","SYSC0_CLK_1","SG4_SGO_0","-","OCU9_OUT0_0","RLT2_TOT_0","BT5_TIOA10_0","-"]
["PPC_PCFGR108","0x0050","P1_08","GPIO","MFS7_CS0_0","- ","-","OCU10_OUT0_0","MFS5_SCK_1","BT5_TIOA11_0","IND0_OUT_1"]
["PPC_PCFGR109","0x0052","P1_09","GPIO","MFS7_CS1_0","- ","-","OCU10_OUT1_0","RLT3_TOT_0","SYSC0_CLK_0","RTC0_WOT"]
["PPC_PCFGR110","0x0054","P1_10","GPIO","- ","- ","- ","-","SMC0_PWM1P","BT6_TIOA12_0","-"]
["PPC_PCFGR111","0x0056","P1_11","GPIO","- ","- ","- ","-","SMC0_PWM1M","BT6_TIOA13_0","-"]
["PPC_PCFGR112","0x0058","P1_12","GPIO","MFS0_SOT_0","-","MFS8_SDA","-","SMC0_PWM2P","BT7_TIOA14_0","-"]
["PPC_PCFGR113","0x005A","P1_13","GPIO","MFS0_SCK_0","- ","MFS8_SCL","-","SMC0_PWM2M","BT7_TIOA15_0","-"]
["PPC_PCFGR114","0x005C","P1_14","GPIO","- ","- ","- ","-","SMC1_PWM1P","BT8_TIOA16_0","-"]
["PPC_PCFGR115","0x005E","P1_15","GPIO","MFS0_CS0_0","- ","- ","-","SMC1_PWM1M","BT8_TIOA17_0","-"]
["PPC_PCFGR116","0x0060","P1_16","GPIO","MFS9_CS0_0","- ","- ","-","SMC1_PWM2P","BT9_TIOA18_0","-"]
["PPC_PCFGR117","0x0062","P1_17","GPIO","MFS9_CS1_0","- ","- ","-","SMC1_PWM2M","BT9_TIOA19_0","-"]
["PPC_PCFGR118","0x0064","P1_18","GPIO","MFS9_SOT_0","-","MFS9_SDA","-","SMC2_PWM1P","BT10_TIOA20_0","-"]
["PPC_PCFGR119","0x0066","P1_19","GPIO","MFS9_SCK_0","- ","MFS9_SCL","-","SMC2_PWM1M","BT10_TIOA21_0","-"]
["PPC_PCFGR120","0x0068","P1_20","GPIO","- ","- ","- ","-","SMC2_PWM2P","BT11_TIOA22_0","-"]
["PPC_PCFGR121","0x006A","P1_21","GPIO","MFS10_SOT_0","-","MFS10_SDA","-","SMC2_PWM2M","BT11_TIOA23_0","-"]
["PPC_PCFGR122","0x006C","P1_22","GPIO","MFS10_SCK_0","-","MFS10_SCL","-","SMC3_PWM1P","- ","-"]
["PPC_PCFGR123","0x006E","P1_23","GPIO","- ","- ","- ","-","SMC3_PWM1M","BT12_TIOA24_0","-"]
["PPC_PCFGR124","0x0070","P1_24","GPIO","MFS10_CS0_0","- ","- ","-","SMC3_PWM2P","BT12_TIOA25_0","-"]
["PPC_PCFGR125","0x0072","P1_25","GPIO","MFS11_CS0_0","- ","- ","-","SMC3_PWM2M","BT13_TIOA26_0"]
["PPC_PCFGR126","0x0074","P1_26","GPIO","MFS11_CS1_0","- ","- ","-","SMC4_PWM1P","BT13_TIOA27_0","-"]
["PPC_PCFGR127","0x0076","P1_27","GPIO","MFS11_SOT_0","-","MFS11_SDA","-","SMC4_PWM1M","BT14_TIOA28_0","-"]
["PPC_PCFGR128","0x0078","P1_28","GPIO","MFS11_SCK_0","-","MFS11_SCL","-","SMC4_PWM2P","BT14_TIOA29_0","-"]
["PPC_PCFGR129","0x007A","P1_29","GPIO","- ","- ","- ","-","SMC4_PWM2M","BT15_TIOA30_0","-"]
["PPC_PCFGR130","0x007C","P1_30","GPIO","MFS5_SOT_0","-","MFS5_SDA","-","SMC5_PWM1P","BT15_TIOA31_0","-"]
["PPC_PCFGR131","0x007E","P1_31","GPIO","MFS5_SCK_0","- ","MFS5_SCL","-","SMC5_PWM1M","- ","-"]
["PPC_PCFGR200","0x0080","P2_00","GPIO","- ","- ","- ","-","SMC5_PWM2P","- ","-"]
["PPC_PCFGR201","0x0082","P2_01","GPIO","MFS5_CS0_0","- ","- ","-","SMC5_PWM2M","- ","-"]
["PPC_PCFGR202","0x0084","P2_02","GPIO","- ","- ","- ","- ","- ","- ","-"]
["PPC_PCFGR203","0x0086","P2_03","GPIO","- ","- ","- ","- ","- ","- ","-"]
["PPC_PCFGR204","0x0088","P2_04","GPIO","MFS2_SOT_1","- ","- ","- ","-","BT12_TIOA24_1","MDATA8"]
["PPC_PCFGR205","0x008A","P2_05","GPIO","MFS2_SCK_1","- ","- ","- ","I2S0_SD_1","BT12_TIOA25_1","MDATA9"]
["PPC_PCFGR206","0x008C","P2_06","GPIO","- ","- ","- ","-","I2S0_WS_1","BT13_TIOA26_1","MDATA10"]
["PPC_PCFGR207","0x008E","P2_07","GPIO","MFS2_CS0_1","- ","- ","-","I2S0_SCK_1","BT13_TIOA27_1","MDATA11"]
["PPC_PCFGR208","0x0090","P2_08","GPIO","MFS2_CS1_1","- ","- ","- ","-","BT14_TIOA28_1","MCSX0"]
["PPC_PCFGR209","0x0092","P2_09","GPIO","MFS3_SOT_1","- ","- ","- ","-","BT14_TIOA29_1","MDATA12"]
["PPC_PCFGR210","0x0094","P2_10","GPIO","MFS3_SCK_1","- ","- ","-","SG0_SGA_2","BT15_TIOA30_1","MDATA13"]
["PPC_PCFGR211","0x0096","P2_11","GPIO","- ","- ","- ","-","SG0_SGO_2","BT15_TIOA31_1","MDATA14"]
["PPC_PCFGR212","0x0098","P2_12","GPIO","MFS3_CS0_1","- ","- ","-","SG1_SGA_2","- ","MDATA15"]
["PPC_PCFGR213","0x009A","P2_13","GPIO","MFS3_CS1_1","- ","- ","-","SG1_SGO_2","- ","MCSX1"]
["PPC_PCFGR214","0x009C","P2_14","GPIO","MFS3_CS2_1","- ","- ","- ","- ","- ","MDATA0"]
["PPC_PCFGR215","0x009E","P2_15","GPIO","MFS3_CS3_1","LCDD0 ","- ","- ","- ","- ","MDATA1"]
["PPC_PCFGR216","0x00A0","P2_16","GPIO","MFS4_SOT_0","LCDD1","MFS4_SDA","- ","- ","- ","MDATA2"]
["PPC_PCFGR217","0x00A2","P2_17","GPIO","MFS4_SCK_0","LCDD2 ","MFS4_SCL","- ","- ","- ","MDATA3"]
["PPC_PCFGR218","0x00A4","P2_18","GPIO","- ","LCDD3 ","- ","- ","- ","- ","MDATA4"]
["PPC_PCFGR219","0x00A6","P2_19","GPIO","MFS4_CS0_0","- ","- ","- ","- ","- ","MDATA5"]
["PPC_PCFGR220","0x00A8","P2_20","GPIO","MFS4_CS1_0","- ","- ","- ","- ","- ","MDATA6"]
["PPC_PCFGR221","0x00AA","P2_21","GPIO","MFS4_CS2_0","- ","- ","- ","- ","- ","MDATA7"]
["PPC_PCFGR222","0x00AC","P2_22","GPIO","MFS4_CS3_0","LCDD4 ","- ","- ","- ","- ","MAD0"]
["PPC_PCFGR223","0x00AE","P2_23","GPIO","MFS1_SOT_0","LCDD5 ","- ","- ","-","MFS1_SDA","MAD1"]
["PPC_PCFGR224","0x00B0","P2_24","GPIO","MFS1_SCK_0","LCDD6 ","- ","- ","- ","MFS1_SCL","MAD2"]
["PPC_PCFGR225","0x00B2","P2_25","GPIO","- ","LCDD7 ","- ","- ","- ","- ","MAD3"]
["PPC_PCFGR226","0x00B4","P2_26","GPIO","MFS1_CS0_0","LCDD8","MFS0_CS0_1","- ","- ","- ","MAD4"]
["PPC_PCFGR227","0x00B6","P2_27","GPIO","MFS1_CS1_0","LCDD9 ","- ","- ","-","MFS0_SOT_1","MAD5"]
["PPC_PCFGR228","0x00B8","P2_28","GPIO","MFS1_CS2_0","LCDD10","MFS0_SCK_1","- ","- ","- ","MAD6"]
["PPC_PCFGR229","0x00BA","P2_29","GPIO","MFS1_CS3_0","LCDD11 ","- ","- ","-","BT0_TIOA0_1","MAD7"]
["PPC_PCFGR300","0x00C0","P3_00","GPIO","MFS1_CS1_1","- ","- ","- ","-","BT4_TIOA8_1","MAD15"]
["PPC_PCFGR301","0x00C2","P3_01","GPIO","MFS1_CS2_1","- ","- ","- ","-","BT4_TIOA9_1","MAD16"]
["PPC_PCFGR302","0x00C4","P3_02","GPIO","MFS1_CS3_1","- ","- ","- ","-","BT5_TIOA10_1","MAD17"]
["PPC_PCFGR303","0x00C6","P3_03","GPIO","- ","- ","- ","- ","-","BT5_TIOA11_1","MAD18"]
["PPC_PCFGR304","0x00C8","P3_04","GPIO","- ","-","BT10_TIOA20_1","- ","- ","- ","MAD19"]
["PPC_PCFGR305","0x00CA","P3_05","GPIO","- ","- ","- ","- ","- ","- ","MAD20"]
["PPC_PCFGR306","0x00CC","P3_06","GPIO","- ","- ","- ","- ","- ","- ","MAD21"]
["PPC_PCFGR307","0x00CE","P3_07","GPIO","- ","- ","- ","- ","-","MFS4_CS3_1","MDQM1"]
["PPC_PCFGR308","0x00D0","P3_08","GPIO","MFS8_SOT_1","SG0_SGA_1","BT6_TIOA12_1","OCU0_OUT0_1","- ","TRACE0_1 ","-"]
["PPC_PCFGR309","0x00D2","P3_09","GPIO","MFS8_SCK_1","SG0_SGO_1","BT6_TIOA13_1","OCU0_OUT1_1","RLT0_TOT_1","TRACE1_1 ","-"]
["PPC_PCFGR310","0x00D4","P3_10","GPIO","-","SG1_SGA_1","BT7_TIOA14_1","OCU1_OUT0_1","- ","TRACE2_1","CAN0_TX_1"]
["PPC_PCFGR311","0x00D6","P3_11","GPIO","MFS10_SOT_1","SG1_SGO_1","BT7_TIOA15_1","OCU1_OUT1_1","RLT1_TOT_1","TRACE3_1 ","-"]
["PPC_PCFGR312","0x00D8","P3_12","GPIO","MFS10_SCK_1","SG2_SGA_1","BT8_TIOA16_1","OCU2_OUT0_1","-","TRACE_CLK_1","CAN1_TX_1"]
["PPC_PCFGR313","0x00DA","P3_13","GPIO","-","SG2_SGO_1","BT8_TIOA17_1","OCU2_OUT1_1","RLT16_TOT_1","TRACE_CTL_1","-"]
["PPC_PCFGR314","0x00DC","P3_14","GPIO","- ","- ","- ","- ","- ","- ","-"]
["PPC_PCFGR315","0x00DE","P3_15","GPIO","- ","-","BT11_TIOA22_1","OCU10_OUT0_1","- ","-","CAN2_TX_1"]
["PPC_PCFGR316","0x00E0","P3_16","GPIO","MFS9_SOT_1","- ","-","OCU9_OUT1_0","- ","- ","-"]
["PPC_PCFGR317","0x00E2","P3_17","GPIO","MFS9_SCK_1","-","BT11_TIOA23_1","OCU10_OUT1_1","- ","- ","-"]
["PPC_PCFGR318","0x00E4","P3_18","GPIO","- ","-","BT10_TIOA21_1","- ","- ","-","CAN3_TX_1"]
["PPC_PCFGR319","0x00E6","P3_19","GPIO","MFS9_CS0_1","SG3_SGA_1","- ","-","RLT3_TOT_1","- ","-"]
["PPC_PCFGR320","0x00E8","P3_20","GPIO","MFS9_CS1_1","SG3_SGO_1","- ","- ","- ","- ","-"]
["PPC_PCFGR321","0x00EA","P3_21","GPIO","- ","- ","-","PWUTRG_1","MFS5_SOT_1","- ","-"]
["PPC_PCFGR322","0x00EC","P3_22","GPIO","-","SG4_SGA_1","- ","- ","- ","- ","-"]
["PPC_PCFGR323","0x00EE","P3_23","GPIO","-","SG4_SGO_1","- ","-","MFS5_CS0_1","- ","-"]
["PPC_PCFGR324","0x00F0","P3_24","GPIO","- ","- ","- ","- ","- ","- ","-"]
["PPC_PCFGR325","0x00F2","P3_25","GPIO","- ","- ","- ","- ","- ","- ","-"]
["PPC_PCFGR326","0x00F4","P3_26","GPIO","- ","- ","- ","- ","- ","- ","-"]
["PPC_PCFGR327","0x00F6","P3_27","GPIO","- ","- ","- ","- ","- ","- ","-"]
["PPC_PCFGR328","0x00F8","P3_28","GPIO","MFS2_CS2_1","- ","- ","- ","- ","- ","-"]
["PPC_PCFGR329","0x00FA","P3_29","GPIO","MFS2_CS3_1","- ","- ","- ","- ","- ","-"]
["PPC_PCFGR330","0x00FC","P3_30","GPIO","- ","- ","- ","- ","- ","- ","-"]
["PPC_PCFGR331","0x00FE","P3_31","GPIO","- ","- ","- ","-","CAN0_TX_2","- ","-"]

{"sheet":"Input Level","index":2,"n_rows":129,"n_cols":7,"rows_kept":129,"cut":false,"hidden":false,"merged":[[0,0,0,6],[1,0,1,1],[1,3,1,6],[1,2,2,2]]}
["Input Level Setting"]
["Pin No. of Package",null,"PORT No.","Value of PPC_PCFGR:PIL[1:0]"]
["TEQFP'-176 ","TEQFP'-144 ",null,"2'b00 ","2'b01 ","2'b10 ","2'b11"]
[2,2,"P0_00","CMOS-hys ","Automotive ","- ","-"]
[3,3,"P0_01","CMOS-hys ","Automotive ","- ","-"]
[4,4,"P0_02","CMOS-hys ","Automotive ","- ","-"]
[5,5,"P0_03","CMOS-hys ","Automotive ","- ","-"]
[6,6,"P0_04","CMOS-hys ","Automotive ","- ","-"]
[7,7,"P0_05","CMOS-hys ","Automotive ","- ","-"]
[8,8,"P0_06","CMOS-hys ","Automotive ","- ","-"]
[19,11,"P0_07","CMOS-hys ","Automotive ","- ","-"]
[20,12,"P0_08","CMOS-hys ","Automotive ","- ","-"]
[21,13,"P0_09","CMOS-hys ","Automotive ","- ","-"]
[22,14,"P0_10","CMOS-hys ","Automotive ","- ","-"]
[23,15,"P0_11","CMOS-hys ","Automotive ","- ","-"]
[24,16,"P0_12","CMOS-hys ","Automotive ","- ","-"]
[27,19,"P0_13","CMOS-hys ","Automotive ","- ","-"]
[28,20,"P0_14","CMOS-hys ","Automotive ","- ","-"]
[29,21,"P0_15","CMOS-hys ","Automotive ","- ","-"]
[30,22,"P0_16","CMOS-hys ","Automotive ","- ","-"]
[31,23,"P0_17","CMOS-hys ","Automotive ","- ","-"]
[34,26,"P0_18","CMOS-hys ","Automotive ","- ","-"]
[36,28,"P0_19","CMOS-hys ","Automotive ","- ","-"]
[37,29,"P0_20","CMOS-hys ","Automotive ","- ","-"]
[38,30,"P0_21","CMOS-hys ","Automotive ","- ","-"]
[39,31,"P0_22","CMOS-hys ","Automotive ","- ","-"]
[40,32,"P0_23","CMOS-hys ","Automotive ","- ","-"]
[43,35,"P0_24","CMOS-hys ","Automotive ","- ","-"]
[64,50,"P0_25","CMOS-hys ","Automotive ","- ","-"]
[65,51,"P0_26","CMOS-hys ","Automotive ","- ","-"]
[66,52,"P0_27","CMOS-hys ","Automotive ","- ","-"]
[67,53,"P0_28","CMOS-hys ","Automotive ","- ","-"]
[68,54,"P0_29","CMOS-hys ","Automotive ","- ","-"]
[70,56,"P0_30","CMOS-hys ","Automotive ","- ","-"]
[71,57,"P0_31","CMOS-hys ","Automotive ","- ","-"]
[74,60,"P1_00","CMOS-hys ","Automotive ","- ","-"]
[75,61,"P1_01","CMOS-hys ","Automotive ","- ","-"]
[76,62,"P1_02","CMOS-hys ","Automotive ","- ","-"]
[77,63,"P1_03","CMOS-hys ","Automotive ","- ","-"]
[78,64,"P1_04","CMOS-hys ","Automotive ","- ","-"]
[79,65,"P1_05","CMOS-hys ","Automotive ","- ","-"]
[80,66,"P1_06","CMOS-hys ","Automotive ","- ","-"]
[81,67,"P1_07","CMOS-hys ","Automotive ","- ","-"]
[96,74,"P1_08","CMOS-hys ","Automotive ","- ","-"]
[101,77,"P1_09","CMOS-hys ","Automotive ","- ","-"]
[104,80,"P1_10","CMOS-hys ","Automotive ","- ","-"]
[105,81,"P1_11","CMOS-hys ","Automotive ","- ","-"]
[106,82,"P1_12","CMOS-hys ","Automotive ","- ","-"]
[107,83,"P1_13","CMOS-hys ","Automotive ","- ","-"]
[108,84,"P1_14","CMOS-hys ","Automotive ","- ","-"]
[109,85,"P1_15","CMOS-hys ","Automotive ","- ","-"]
[110,86,"P1_16","CMOS-hys ","Automotive ","- ","-"]
[111,87,"P1_17","CMOS-hys ","Automotive ","- ","-"]
[114,90,"P1_18","CMOS-hys ","Automotive ","- ","-"]
[115,91,"P1_19","CMOS-hys ","Automotive ","- ","-"]
[116,92,"P1_20","CMOS-hys ","Automotive ","- ","-"]
[117,93,"P1_21","CMOS-hys ","Automotive ","- ","-"]
[118,94,"P1_22","CMOS-hys ","Automotive ","- ","-"]
[119,95,"P1_23","CMOS-hys ","Automotive ","- ","-"]
[120,96,"P1_24","CMOS-hys ","Automotive ","- ","-"]
[121,97,"P1_25","CMOS-hys ","Automotive ","- ","-"]
[124,100,"P1_26","CMOS-hys ","Automotive ","- ","-"]
[125,101,"P1_27","CMOS-hys ","Automotive ","- ","-"]
[126,102,"P1_28","CMOS-hys ","Automotive ","- ","-"]
[127,103,"P1_29","CMOS-hys ","Automotive ","- ","-"]
[128,104,"P1_30","CMOS-hys ","Automotive ","- ","-"]
[129,105,"P1_31","CMOS-hys ","Automotive ","- ","-"]
[130,106,"P2_00","CMOS-hys ","Automotive ","- ","-"]
[131,107,"P2_01","CMOS-hys ","Automotive ","- ","-"]
[142,112,"P2_02","CMOS-hys ","Automotive ","- ","-"]
[143,113,"P2_03","CMOS-hys ","Automotive ","- ","-"]
[144,114,"P2_04","CMOS-hys ","Automotive ","- ","-"]
[145,115,"P2_05","CMOS-hys ","Automotive ","- ","-"]
[146,116,"P2_06","CMOS-hys ","Automotive ","- ","-"]
[147,117,"P2_07","CMOS-hys ","Automotive ","- ","-"]
[148,118,"P2_08","CMOS-hys ","Automotive ","- ","-"]
[151,121,"P2_09","CMOS-hys ","Automotive ","- ","-"]
[152,122,"P2_10","CMOS-hys ","Automotive ","- ","-"]
[153,123,"P2_11","CMOS-hys ","Automotive ","- ","-"]
[154,124,"P2_12","CMOS-hys ","Automotive ","- ","-"]
[155,125,"P2_13","CMOS-hys ","Automotive ","- ","-"]
[156,126,"P2_14","CMOS-hys ","Automotive ","- ","-"]
[157,127,"P2_15","CMOS-hys ","Automotive ","- ","-"]
[158,128,"P2_16","CMOS-hys ","Automotive ","- ","-"]
[159,129,"P2_17","CMOS-hys ","Automotive ","- ","-"]
[160,130,"P2_18","CMOS-hys ","Automotive ","- ","-"]
[161,131,"P2_19","CMOS-hys ","Automotive ","- ","-"]
[162,132,"P2_20","CMOS-hys ","Automotive ","- ","-"]
[163,133,"P2_21","CMOS-hys ","Automotive ","- ","-"]
[166,136,"P2_22","CMOS-hys ","Automotive ","- ","-"]
[167,137,"P2_23","CMOS-hys ","Automotive ","- ","-"]
[168,138,"P2_24","CMOS-hys ","Automotive ","- ","-"]
[169,139,"P2_25","CMOS-hys ","Automotive ","- ","-"]
[170,140,"P2_26","CMOS-hys ","Automotive ","- ","-"]
[173,141,"P2_27","CMOS-hys ","Automotive ","- ","-"]
[174,142,"P2_28","CMOS-hys ","Automotive ","- ","-"]
[175,143,"P2_29","CMOS-hys ","Automotive ","- ","-"]
[9,"- ","P3_00","CMOS-hys ","Automotive ","- ","-"]
[10,"- ","P3_01","CMOS-hys ","Automotive ","- ","-"]
[11,"- ","P3_02","CMOS-hys ","Automotive ","- ","-"]
[14,"- ","P3_03","CMOS-hys ","Automotive ","- ","-"]
[15,"- ","P3_04","CMOS-hys ","Automotive ","- ","-"]
[16,"- ","P3_05","CMOS-hys ","Automotive ","- ","-"]
[17,"- ","P3_06","CMOS-hys ","Automotive ","- ","-"]
[18,"- ","P3_07","CMOS-hys ","Automotive ","- ","-"]
[58,"- ","P3_08","CMOS-hys ","Automotive ","- ","-"]
[59,"- ","P3_09","CMOS-hys ","Automotive ","- ","-"]
[60,"- ","P3_10","CMOS-hys ","Automotive ","- ","-"]
[61,"- ","P3_11","CMOS-hys ","Automotive ","- ","-"]
[62,"- ","P3_12","CMOS-hys ","Automotive ","- ","-"]
[63,"- ","P3_13","CMOS-hys ","Automotive ","- ","-"]
[82,"- ","P3_14","CMOS-hys ","Automotive ","- ","-"]
[83,"- ","P3_15","CMOS-hys ","Automotive ","- ","-"]
[90,"- ","P3_16","CMOS-hys ","Automotive ","- ","-"]
[91,"- ","P3_17","CMOS-hys ","Automotive ","- ","-"]
[92,"- ","P3_18","CMOS-hys ","Automotive ","- ","-"]
[93,"- ","P3_19","CMOS-hys ","Automotive ","- ","-"]
[94,"- ","P3_20","CMOS-hys ","Automotive ","- ","-"]
[95,"- ","P3_21","CMOS-hys ","Automotive ","- ","-"]
[97,"- ","P3_22","CMOS-hys ","Automotive ","- ","-"]
[98,"- ","P3_23","CMOS-hys ","Automotive ","- ","-"]
[134,"- ","P3_24","CMOS-hys ","Automotive ","- ","-"]
[135,"- ","P3_25","CMOS-hys ","Automotive ","- ","-"]
[138,"- ","P3_26","CMOS-hys ","Automotive ","- ","-"]
[139,"- ","P3_27","CMOS-hys ","Automotive ","- ","-"]
[140,"- ","P3_28","CMOS-hys ","Automotive ","- ","-"]
[141,"- ","P3_29","CMOS-hys ","Automotive ","- ","-"]
[171,"- ","P3_30","CMOS-hys ","Automotive ","- ","-"]
[172,"- ","P3_31","CMOS-hys ","Automotive ","- ","-"]

{"sheet":"Output Drive Capacity","index":3,"n_rows":129,"n_cols":7,"rows_kept":129,"cut":false,"hidden":false,"merged":[[0,0,0,6],[1,0,1,1],[1,3,1,6],[1,2,2,2]]}
["Output Drive Capacity Setting"]
["Pin No. of Package",null,"PORT NO.","Value of PPC_PCFGR:ODR[1:0]"]
["TEQFP'-176 ","TEQFP'-144 ",null,"2'b00 ","2'b01 ","2'b10 ","2'b11"]
[2,2,"P0_00","1mA ","2mA ","- ","5mA"]
[3,3,"P0_01","1mA ","2mA ","- ","5mA"]
[4,4,"P0_02","1mA ","2mA ","- ","5mA"]
[5,5,"P0_03","1mA ","2mA ","- ","5mA"]
[6,6,"P0_04","1mA ","2mA ","- ","5mA"]
[7,7,"P0_05","1mA ","2mA ","- ","5mA"]
[8,8,"P0_06","1mA ","2mA ","- ","5mA"]
[19,11,"P0_07","1mA ","2mA ","- ","5mA"]
[20,12,"P0_08","1mA ","2mA ","- ","5mA"]
[21,13,"P0_09","1mA ","2mA ","- ","5mA"]
[22,14,"P0_10","1mA ","2mA ","- ","5mA"]
[23,15,"P0_11","1mA ","2mA ","- ","5mA"]
[24,16,"P0_12","1mA ","2mA ","- ","5mA"]
[27,19,"P0_13","1mA ","2mA ","5mA ","15mA"]
[28,20,"P0_14","1mA ","2mA ","5mA ","15mA"]
[29,21,"P0_15","1mA ","2mA ","5mA ","15mA"]
[30,22,"P0_16","1mA ","2mA ","5mA ","15mA"]
[31,23,"P0_17","1mA ","2mA ","5mA ","15mA"]
[34,26,"P0_18","1mA ","2mA ","5mA ","15mA"]
[36,28,"P0_19","1mA ","2mA ","5mA ","15mA"]
[37,29,"P0_20","1mA ","2mA ","5mA ","15mA"]
[38,30,"P0_21","1mA ","2mA ","5mA ","15mA"]
[39,31,"P0_22","1mA ","2mA ","5mA ","15mA"]
[40,32,"P0_23","1mA ","2mA ","5mA ","15mA"]
[43,35,"P0_24","1mA ","2mA ","5mA ","15mA"]
[64,50,"P0_25","1mA ","2mA ","- ","5mA"]
[65,51,"P0_26","1mA ","2mA ","- ","5mA"]
[66,52,"P0_27","1mA ","2mA ","- ","5mA"]
[67,53,"P0_28","1mA ","2mA ","- ","5mA"]
[68,54,"P0_29","1mA ","2mA ","- ","5mA"]
[70,56,"P0_30","1mA ","2mA ","- ","5mA"]
[71,57,"P0_31","1mA ","2mA ","- ","5mA"]
[74,60,"P1_00","1mA ","2mA ","- ","5mA"]
[75,61,"P1_01","1mA ","2mA ","- ","5mA"]
[76,62,"P1_02","1mA ","2mA ","- ","5mA"]
[77,63,"P1_03","1mA ","2mA ","- ","5mA"]
[78,64,"P1_04","1mA ","2mA ","- ","5mA"]
[79,65,"P1_05","1mA ","2mA ","- ","5mA"]
[80,66,"P1_06","1mA ","2mA ","- ","5mA"]
[81,67,"P1_07","1mA ","2mA ","- ","5mA"]
[96,74,"P1_08","1mA ","2mA ","- ","5mA"]
[101,77,"P1_09","1mA ","2mA ","- ","5mA"]
[104,80,"P1_10","1mA ","2mA ","5mA ","30mA"]
[105,81,"P1_11","1mA ","2mA ","5mA ","30mA"]
[106,82,"P1_12","1mA ","2mA ","5mA ","30mA"]
[107,83,"P1_13","1mA ","2mA ","5mA ","30mA"]
[108,84,"P1_14","1mA ","2mA ","5mA ","30mA"]
[109,85,"P1_15","1mA ","2mA ","5mA ","30mA"]
[110,86,"P1_16","1mA ","2mA ","5mA ","30mA"]
[111,87,"P1_17","1mA ","2mA ","5mA ","30mA"]
[114,90,"P1_18","1mA ","2mA ","5mA ","30mA"]
[115,91,"P1_19","1mA ","2mA ","5mA ","30mA"]
[116,92,"P1_20","1mA ","2mA ","5mA ","30mA"]
[117,93,"P1_21","1mA ","2mA ","5mA ","30mA"]
[118,94,"P1_22","1mA ","2mA ","5mA ","30mA"]
[119,95,"P1_23","1mA ","2mA ","5mA ","30mA"]
[120,96,"P1_24","1mA ","2mA ","5mA ","30mA"]
[121,97,"P1_25","1mA ","2mA ","5mA ","30mA"]
[124,100,"P1_26","1mA ","2mA ","5mA ","30mA"]
[125,101,"P1_27","1mA ","2mA ","5mA ","30mA"]
[126,102,"P1_28","1mA ","2mA ","5mA ","30mA"]
[127,103,"P1_29","1mA ","2mA ","5mA ","30mA"]
[128,104,"P1_30","1mA ","2mA ","5mA ","30mA"]
[129,105,"P1_31","1mA ","2mA ","5mA ","30mA"]
[130,106,"P2_00","1mA ","2mA ","5mA ","30mA"]
[131,107,"P2_01","1mA ","2mA ","5mA ","30mA"]
[142,112,"P2_02","- ","- ","- ","-"]
[143,113,"P2_03","1mA ","2mA ","- ","5mA"]
[144,114,"P2_04","1mA ","2mA ","- ","5mA"]
[145,115,"P2_05","1mA ","2mA ","- ","5mA"]
[146,116,"P2_06","1mA ","2mA ","- ","5mA"]
[147,117,"P2_07","1mA ","2mA ","- ","5mA"]
[148,118,"P2_08","1mA ","2mA ","- ","5mA"]
[151,121,"P2_09","1mA ","2mA ","- ","5mA"]
[152,122,"P2_10","1mA ","2mA ","- ","5mA"]
[153,123,"P2_11","1mA ","2mA ","- ","5mA"]
[154,124,"P2_12","1mA ","2mA ","- ","5mA"]
[155,125,"P2_13","1mA ","2mA ","- ","5mA"]
[156,126,"P2_14","1mA ","2mA ","- ","5mA"]
[157,127,"P2_15","1mA ","2mA ","- ","5mA"]
[158,128,"P2_16","1mA ","2mA ","- ","5mA"]
[159,129,"P2_17","1mA ","2mA ","- ","5mA"]
[160,130,"P2_18","1mA ","2mA ","- ","5mA"]
[161,131,"P2_19","1mA ","2mA ","- ","5mA"]
[162,132,"P2_20","1mA ","2mA ","- ","5mA"]
[163,133,"P2_21","1mA ","2mA ","- ","5mA"]
[166,136,"P2_22","1mA ","2mA ","- ","5mA"]
[167,137,"P2_23","1mA ","2mA ","- ","5mA"]
[168,138,"P2_24","1mA ","2mA ","- ","5mA"]
[169,139,"P2_25","1mA ","2mA ","- ","5mA"]
[170,140,"P2_26","1mA ","2mA ","- ","5mA"]
[173,141,"P2_27","1mA ","2mA ","- ","5mA"]
[174,142,"P2_28","1mA ","2mA ","- ","5mA"]
[175,143,"P2_29","1mA ","2mA ","- ","5mA"]
[9,"- ","P3_00","1mA ","2mA ","- ","5mA"]
[10,"- ","P3_01","1mA ","2mA ","- ","5mA"]
[11,"- ","P3_02","1mA ","2mA ","- ","5mA"]
[14,"- ","P3_03","1mA ","2mA ","- ","5mA"]
[15,"- ","P3_04","1mA ","2mA ","- ","5mA"]
[16,"- ","P3_05","1mA ","2mA ","- ","5mA"]
[17,"- ","P3_06","1mA ","2mA ","- ","5mA"]
[18,"- ","P3_07","1mA ","2mA ","- ","5mA"]
[58,"- ","P3_08","1mA ","2mA ","- ","5mA"]
[59,"- ","P3_09","1mA ","2mA ","- ","5mA"]
[60,"- ","P3_10","1mA ","2mA ","- ","5mA"]
[61,"- ","P3_11","1mA ","2mA ","- ","5mA"]
[62,"- ","P3_12","1mA ","2mA ","- ","5mA"]
[63,"- ","P3_13","1mA ","2mA ","- ","5mA"]
[82,"- ","P3_14","1mA ","2mA ","- ","5mA"]
[83,"- ","P3_15","1mA ","2mA ","- ","5mA"]
[90,"- ","P3_16","1mA ","2mA ","- ","5mA"]
[91,"- ","P3_17","1mA ","2mA ","- ","5mA"]
[92,"- ","P3_18","1mA ","2mA ","- ","5mA"]
[93,"- ","P3_19","1mA ","2mA ","- ","5mA"]
[94,"- ","P3_20","1mA ","2mA ","- ","5mA"]
[95,"- ","P3_21","1mA ","2mA ","- ","5mA"]
[97,"- ","P3_22","1mA ","2mA ","- ","5mA"]
[98,"- ","P3_23","1mA ","2mA ","- ","5mA"]
[134,"- ","P3_24","1mA ","2mA ","- ","5mA"]
[135,"- ","P3_25","1mA ","2mA ","- ","5mA"]
[138,"- ","P3_26","1mA ","2mA ","- ","5mA"]
[139,"- ","P3_27","1mA ","2mA ","- ","5mA"]
[140,"- ","P3_28","1mA ","2mA ","- ","5mA"]
[141,"- ","P3_29","1mA ","2mA ","- ","5mA"]
[171,"- ","P3_30","1mA ","2mA ","- ","5mA"]
[172,"- ","P3_31","1mA ","2mA ","- ","5mA"]

{"sheet":"Configuration Export","index":4,"n_rows":128,"n_cols":25,"rows_kept":128,"cut":false,"hidden":false,"merged":[[0,9,0,16],[0,17,0,24],[0,0,1,0],[0,1,1,1],[0,2,1,2],[0,3,1,3],[0,4,1,4],[0,5,1,5],[0,6,1,6],[0,7,1,7],[0,8,1,8]]}
["Port Name","Port Number","Bit Number","PCFGR Offset","Output Reg","Input Reg","Valid","Remap","Remap Name","Run Mode",{"$nulls":7},"Sleep Mode"]
[{"$nulls":9},"Direction","Default","Input Enable","Input Level","Filter Enable","Pull Up/Dn","Output Func","Output Drive","Direction","Default","Input Enable","Input Level","Filter Enable","Pull Up/Dn","Output Func","Output Drive"]
["P0_00",0,0,"0x0000","GPIO_PODR0_POD0","GPIO_PIDR0_PID0",{"$f":"IF(ISNA(VLOOKUP($A3,'GPIO Configuration'!$B$4:$C$97,2,FALSE)),0,1)","v":1},{"$f":"IF(ISNA(VLOOKUP($A3,'GPIO Configuration'!$B$4:$C$97,2,FALSE)),0,IF(VLOOKUP($A3,'GPIO Configuration'!$B$4:$C$97,2,FALSE)=\"是\",1,0))","v":0},{"$f":"IF(ISNA(VLOOKUP($A3,'GPIO Configuration'!$B$4:$D$97,3,FALSE)),\"\",TRIM(VLOOKUP($A3,'GPIO Configuration'!$B$4:$D$97,3,FALSE)))","v":""},{"$f":"IF(ISNA(VLOOKUP($A3,'GPIO Configuration'!$B$4:$E$97,4,FALSE)),0,IF(VLOOKUP($A3,'GPIO Configuration'!$B$4:$E$97,4,FALSE)=\"OUT - 输出\",1,0))","v":1},{"$f":"IF(ISNA(VLOOKUP($A3,'GPIO Configuration'!$B$4:$F$97,5,FALSE)),0,IF(VLOOKUP($A3,'GPIO Configuration'!$B$4:$F$97,5,FALSE)=\"1 - 高电平\",1,0))","v":0},{"$f":"IF(ISNA(VLOOKUP($A3,'GPIO Configuration'!$B$4:$K$97,10,FALSE)),0,IF(VLOOKUP($A3,'GPIO Configuration'!$B$4:$K$97,10,FALSE)=\"1 - 使能\",1,0))","v":0},{"$f":"IF(ISNA(VLOOKUP($A3,'GPIO Configuration'!$B$4:$J$97,9,FALSE)),0,MATCH(VLOOKUP($A3,'GPIO Configuration'!$B$4:$J$97,9,FALSE),INDIRECT($A3&\"_InLv\"),0)-1)","v":0},{"$f":"IF(ISNA(VLOOKUP($A3,'GPIO Configuration'!$B$4:$L$97,11,FALSE)),0,IF(VLOOKUP($A3,'GPIO Configuration'!$B$4:$L$97,11,FALSE)=\"1 - 使能\",1,0))","v":1},{"$f":"IF(ISNA(VLOOKUP($A3,'GPIO Configuration'!$B$4:$I$97,8,FALSE)),0,IF(VLOOKUP($A3,'GPIO Configuration'!$B$4:$I$97,8,FALSE)=\"上拉\",2,IF(VLOOKUP($A3,'GPIO Configuration'!$B$4:$I$97,8,FALSE)=\"下拉\",1,0)))","v":0},{"$f":"IF(ISNA(VLOOKUP($A3,'GPIO Configuration'!$B$4:$G$97,6,FALSE)),0,MATCH(VLOOKUP($A3,'GPIO Configuration'!$B$4:$G$97,6,FALSE),INDIRECT($A3&\"_Func\"),0)-1)","v":0},{"$f":"IF(ISNA(VLOOKUP($A3,'GPIO Configuration'!$B$4:$H$97,7,FALSE)),0,MATCH(VLOOKUP($A3,'GPIO Configuration'!$B$4:$H$97,7,FALSE),INDIRECT($A3&\"_OutDrv\"),0)-1)","v":3},{"$f":"IF(ISNA(VLOOKUP($A3,'GPIO Configuration'!$B$4:$M$97,12,FALSE)),0,IF(VLOOKUP($A3,'GPIO Configuration'!$B$4:$M$97,12,FALSE)=\"OUT - 输出\",1,0))","v":1},{"$f":"IF(ISNA(VLOOKUP($A3,'GPIO Configuration'!$B$4:$N$97,13,FALSE)),0,IF(VLOOKUP($A3,'GPIO Configuration'!$B$4:$N$97,13,FALSE)=\"1 - 高电平\",1,0))","v":0},{"$f":"IF(ISNA(VLOOKUP($A3,'GPIO Configuration'!$B$4:$S$97,18,FALSE)),0,IF(VLOOKUP($A3,'GPIO Configuration'!$B$4:$S$97,18,FALSE)=\"1 - 使能\",1,0))","v":0},{"$f":"IF(ISNA(VLOOKUP($A3,'GPIO Configuration'!$B$4:$R$97,17,FALSE)),0,MATCH(VLOOKUP($A3,'GPIO Configuration'!$B$4:$R$97,17,FALSE),INDIRECT($A3&\"_InLv\"),0)-1)","v":0},{"$f":"IF(ISNA(VLOOKUP($A3,'GPIO Configuration'!$B$4:$T$97,19,FALSE)),0,IF(VLOOKUP($A3,'GPIO Configuration'!$B$4:$T$97,19,FALSE)=\"1 - 使能\",1,0))","v":1},{"$f":"IF(ISNA(VLOOKUP($A3,'GPIO Configuration'!$B$4:$Q$97,16,FALSE)),0,IF(VLOOKUP($A3,'GPIO Configuration'!$B$4:$Q$97,16,FALSE)=\"上拉\",2,IF(VLOOKUP($A3,'GPIO Configuration'!$B$4:$Q$97,16,FALSE)=\"下拉\",1,0)))","v":0},{"$f":"IF(ISNA(VLOOKUP($A3,'GPIO Configuration'!$B$4:$O$97,14,FALSE)),0,MATCH(VLOOKUP($A3,'GPIO Configuration'!$B$4:$O$97,14,FALSE),INDIRECT($A3&\"_Func\"),0)-1)","v":0},{"$f":"IF(ISNA(VLOOKUP($A3,'GPIO Configuration'!$B$4:$P$97,15,FALSE)),0,MATCH(VLOOKUP($A3,'GPIO Configuration'!$B$4:$P$97,15,FALSE),INDIRECT($A3&\"_OutDrv\"),0)-1)","v":0}]
["P0_01",0,1,"0x0001","GPIO_PODR0_POD1","GPIO_PIDR0_PID1",{"$f":"IF(ISNA(VLOOKUP($A4,'GPIO Configuration'!$B$4:$C$97,2,FALSE)),0,1)","v":1},{"$f":"IF(ISNA(VLOOKUP($A4,'GPIO Configuration'!$B$4:$C$97,2,FALSE)),0,IF(VLOOKUP($A4,'GPIO Configuration'!$B$4:$C$97,2,FALSE)=\"是\",1,0))","v":0},{"$f":"IF(ISNA(VLOOKUP($A4,'GPIO Configuration'!$B$4:$D$97,3,FALSE)),\"\",TRIM(VLOOKUP($A4,'GPIO Configuration'!$B$4:$D$97,3,FALSE)))","v":""},{"$f":"IF(ISNA(VLOOKUP($A4,'GPIO Configuration'!$B$4:$E$97,4,FALSE)),0,IF(VLOOKUP($A4,'GPIO Configuration'!$B$4:$E$97,4,FALSE)=\"OUT - 输出\",1,0))","v":1},{"$f":"IF(ISNA(VLOOKUP($A4,'GPIO Configuration'!$B$4:$F$97,5,FALSE)),0,IF(VLOOKUP($A4,'GPIO Configuration'!$B$4:$F$97,5,FALSE)=\"1 - 高电平\",1,0))","v":0},{"$f":"IF(ISNA(VLOOKUP($A4,'GPIO Configuration'!$B$4:$K$97,10,FALSE)),0,IF(VLOOKUP($A4,'GPIO Configuration'!$B$4:$K$97,10,FALSE)=\"1 - 使能\",1,0))","v":0},{"$f":"IF(ISNA(VLOOKUP($A4,'GPIO Configuration'!$B$4:$J$97,9,FALSE)),0,MATCH(VLOOKUP($A4,'GPIO Configuration'!$B$4:$J$97,9,FALSE),INDIRECT($A4&\"_InLv\"),0)-1)","v":0},{"$f":"IF(ISNA(VLOOKUP($A4,'GPIO Configuration'!$B$4:$L$97,11,FALSE)),0,IF(VLOOKUP($A4,'GPIO Configuration'!$B$4:$L$97,11,FALSE)=\"1 - 使能\",1,0))","v":1},{"$f":"IF(ISNA(VLOOKUP($A4,'GPIO Configuration'!$B$4:$I$97,8,FALSE)),0,IF(VLOOKUP($A4,'GPIO Configuration'!$B$4:$I$97,8,FALSE)=\"上拉\",2,IF(VLOOKUP($A4,'GPIO Configuration'!$B$4:$I$97,8,FALSE)=\"下拉\",1,0)))","v":0},{"$f":"IF(ISNA(VLOOKUP($A4,'GPIO Configuration'!$B$4:$G$97,6,FALSE)),0,MATCH(VLOOKUP($A4,'GPIO Configuration'!$B$4:$G$97,6,FALSE),INDIRECT($A4&\"_Func\"),0)-1)","v":0},{"$f":"IF(ISNA(VLOOKUP($A4,'GPIO Configuration'!$B$4:$H$97,7,FALSE)),0,MATCH(VLOOKUP($A4,'GPIO Configuration'!$B$4:$H$97,7,FALSE),INDIRECT($A4&\"_OutDrv\"),0)-1)","v":3},{"$f":"IF(ISNA(VLOOKUP($A4,'GPIO Configuration'!$B$4:$M$97,12,FALSE)),0,IF(VLOOKUP($A4,'GPIO Configuration'!$B$4:$M$97,12,FALSE)=\"OUT - 输出\",1,0))","v":1},{"$f":"IF(ISNA(VLOOKUP($A4,'GPIO Configuration'!$B$4:$N$97,13,FALSE)),0,IF(VLOOKUP($A4,'GPIO Configuration'!$B$4:$N$97,13,FALSE)=\"1 - 高电平\",1,0))","v":0},{"$f":"IF(ISNA(VLOOKUP($A4,'GPIO Configuration'!$B$4:$S$97,18,FALSE)),0,IF(VLOOKUP($A4,'GPIO Configuration'!$B$4:$S$97,18,FALSE)=\"1 - 使能\",1,0))","v":0},{"$f":"IF(ISNA(VLOOKUP($A4,'GPIO Configuration'!$B$4:$R$97,17,FALSE)),0,MATCH(VLOOKUP($A4,'GPIO Configuration'!$B$4:$R$97,17,FALSE),INDIRECT($A4&\"_InLv\"),0)-1)","v":0},{"$f":"IF(ISNA(VLOOKUP($A4,'GPIO Configuration'!$B$4:$T$97,19,FALSE)),0,IF(VLOOKUP($A4,'GPIO Configuration'!$B$4:$T$97,19,FALSE)=\"1 - 使能\",1,0))","v":1},{"$f":"IF(ISNA(VLOOKUP($A4,'GPIO Configuration'!$B$4:$Q$97,16,FALSE)),0,IF(VLOOKUP($A4,'GPIO Configuration'!$B$4:$Q$97,16,FALSE)=\"上拉\",2,IF(VLOOKUP($A4,'GPIO Configuration'!$B$4:$Q$97,16,FALSE)=\"下拉\",1,0)))","v":0},{"$f":"IF(ISNA(VLOOKUP($A4,'GPIO Configuration'!$B$4:$O$97,14,FALSE)),0,MATCH(VLOOKUP($A4,'GPIO Configuration'!$B$4:$O$97,14,FALSE),INDIRECT($A4&\"_Func\"),0)-1)","v":0},{"$f":"IF(ISNA(VLOOKUP($A4,'GPIO Configuration'!$B$4:$P$97,15,FALSE)),0,MATCH(VLOOKUP($A4,'GPIO Configuration'!$B$4:$P$97,15,FALSE),INDIRECT($A4&\"_OutDrv\"),0)-1)","v":0}]
["P0_02",0,2,"0x0002","GPIO_PODR0_POD2","GPIO_PIDR0_PID2",{"$f":"IF(ISNA(VLOOKUP($A5,'GPIO Configuration'!$B$4:$C$97,2,FALSE)),0,1)","v":1},{"$f":"IF(ISNA(VLOOKUP($A5,'GPIO Configuration'!$B$4:$C$97,2,FALSE)),0,IF(VLOOKUP($A5,'GPIO Configuration'!$B$4:$C$97,2,FALSE)=\"是\",1,0))","v":0},{"$f":"IF(ISNA(VLOOKUP($A5,'GPIO Configuration'!$B$4:$D$97,3,FALSE)),\"\",TRIM(VLOOKUP($A5,'GPIO Configuration'!$B$4:$D$97,3,FALSE)))","v":""},{"$f":"IF(ISNA(VLOOKUP($A5,'GPIO Configuration'!$B$4:$E$97,4,FALSE)),0,IF(VLOOKUP($A5,'GPIO Configuration'!$B$4:$E$97,4,FALSE)=\"OUT - 输出\",1,0))","v":1},{"$f":"IF(ISNA(VLOOKUP($A5,'GPIO Configuration'!$B$4:$F$97,5,FALSE)),0,IF(VLOOKUP($A5,'GPIO Configuration'!$B$4:$F$97,5,FALSE)=\"1 - 高电平\",1,0))","v":0},{"$f":"IF(ISNA(VLOOKUP($A5,'GPIO Configuration'!$B$4:$K$97,10,FALSE)),0,IF(VLOOKUP($A5,'GPIO Configuration'!$B$4:$K$97,10,FALSE)=\"1 - 使能\",1,0))","v":0},{"$f":"IF(ISNA(VLOOKUP($A5,'GPIO Configuration'!$B$4:$J$97,9,FALSE)),0,MATCH(VLOOKUP($A5,'GPIO Configuration'!$B$4:$J$97,9,FALSE),INDIRECT($A5&\"_InLv\"),0)-1)","v":0},{"$f":"IF(ISNA(VLOOKUP($A5,'GPIO Configuration'!$B$4:$L$97,11,FALSE)),0,IF(VLOOKUP($A5,'GPIO Configuration'!$B$4:$L$97,11,FALSE)=\"1 - 使能\",1,0))","v":1},{"$f":"IF(ISNA(VLOOKUP($A5,'GPIO Configuration'!$B$4:$I$97,8,FALSE)),0,IF(VLOOKUP($A5,'GPIO Configuration'!$B$4:$I$97,8,FALSE)=\"上拉\",2,IF(VLOOKUP($A5,'GPIO Configuration'!$B$4:$I$97,8,FALSE)=\"下拉\",1,0)))","v":0},{"$f":"IF(ISNA(VLOOKUP($A5,'GPIO Configuration'!$B$4:$G$97,6,FALSE)),0,MATCH(VLOOKUP($A5,'GPIO Configuration'!$B$4:$G$97,6,FALSE),INDIRECT($A5&\"_Func\"),0)-1)","v":0},{"$f":"IF(ISNA(VLOOKUP($A5,'GPIO Configuration'!$B$4:$H$97,7,FALSE)),0,MATCH(VLOOKUP($A5,'GPIO Configuration'!$B$4:$H$97,7,FALSE),INDIRECT($A5&\"_OutDrv\"),0)-1)","v":3},{"$f":"IF(ISNA(VLOOKUP($A5,'GPIO Configuration'!$B$4:$M$97,12,FALSE)),0,IF(VLOOKUP($A5,'GPIO Configuration'!$B$4:$M$97,12,FALSE)=\"OUT - 输出\",1,0))","v":1},{"$f":"IF(ISNA(VLOOKUP($A5,'GPIO Configuration'!$B$4:$N$97,13,FALSE)),0,IF(VLOOKUP($A5,'GPIO Configuration'!$B$4:$N$97,13,FALSE)=\"1 - 高电平\",1,0))","v":0},{"$f":"IF(ISNA(VLOOKUP($A5,'GPIO Configuration'!$B$4:$S$97,18,FALSE)),0,IF(VLOOKUP($A5,'GPIO Configuration'!$B$4:$S$97,18,FALSE)=\"1 - 使能\",1,0))","v":0},{"$f":"IF(ISNA(VLOOKUP($A5,'GPIO Configuration'!$B$4:$R$97,17,FALSE)),0,MATCH(VLOOKUP($A5,'GPIO Configuration'!$B$4:$R$97,17,FALSE),INDIRECT($A5&\"_InLv\"),0)-1)","v":0},{"$f":"IF(ISNA(VLOOKUP($A5,'GPIO Configuration'!$B$4:$T$97,19,FALSE)),0,IF(VLOOKUP($A5,'GPIO Configuration'!$B$4:$T$97,19,FALSE)=\"1 - 使能\",1,0))","v":1},{"$f":"IF(ISNA(VLOOKUP($A5,'GPIO Configuration'!$B$4:$Q$97,16,FALSE)),0,IF(VLOOKUP($A5,'GPIO Configuration'!$B$4:$Q$97,16,FALSE)=\"上拉\",2,IF(VLOOKUP($A5,'GPIO Configuration'!$B$4:$Q$97,16,FALSE)=\"下拉\",1,0)))","v":0},{"$f":"IF(ISNA(VLOOKUP($A5,'GPIO Configuration'!$B$4:$O$97,14,FALSE)),0,MATCH(VLOOKUP($A5,'GPIO Configuration'!$B$4:$O$97,14,FALSE),INDIRECT($A5&\"_Func\"),0)-1)","v":0},{"$f":"IF(ISNA(VLOOKUP($A5,'GPIO Configuration'!$B$4:$P$97,15,FALSE)),0,MATCH(VLOOKUP($A5,'GPIO Configuration'!$B$4:$P$97,15,FALSE),INDIRECT($A5&\"_OutDrv\"),0)-1)","v":0}]
["P0_03",0,3,"0x0003","GPIO_PODR0_POD3","GPIO_PIDR0_PID3",{"$f":"IF(ISNA(VLOOKUP($A6,'GPIO Configuration'!$B$4:$C$97,2,FALSE)),0,1)","v":1},{"$f":"IF(ISNA(VLOOKUP($A6,'GPIO Configuration'!$B$4:$C$97,2,FALSE)),0,IF(VLOOKUP($A6,'GPIO Configuration'!$B$4:$C$97,2,FALSE)=\"是\",1,0))","v":0},{"$f":"IF(ISNA(VLOOKUP($A6,'GPIO Configuration'!$B$4:$D$97,3,FALSE)),\"\",TRIM(VLOOKUP($A6,'GPIO Configuration'!$B$4:$D$97,3,FALSE)))","v":""},{"$f":"IF(ISNA(VLOOKUP($A6,'GPIO Configuration'!$B$4:$E$97,4,FALSE)),0,IF(VLOOKUP($A6,'GPIO Configuration'!$B$4:$E$97,4,FALSE)=\"OUT - 输出\",1,0))","v":1},{"$f":"IF(ISNA(VLOOKUP($A6,'GPIO Configuration'!$B$4:$F$97,5,FALSE)),0,IF(VLOOKUP($A6,'GPIO Configuration'!$B$4:$F$97,5,FALSE)=\"1 - 高电平\",1,0))","v":0},{"$f":"IF(ISNA(VLOOKUP($A6,'GPIO Configuration'!$B$4:$K$97,10,FALSE)),0,IF(VLOOKUP($A6,'GPIO Configuration'!$B$4:$K$97,10,FALSE)=\"1 - 使能\",1,0))","v":0},{"$f":"IF(ISNA(VLOOKUP($A6,'GPIO Configuration'!$B$4:$J$97,9,FALSE)),0,MATCH(VLOOKUP($A6,'GPIO Configuration'!$B$4:$J$97,9,FALSE),INDIRECT($A6&\"_InLv\"),0)-1)","v":0},{"$f":"IF(ISNA(VLOOKUP($A6,'GPIO Configuration'!$B$4:$L$97,11,FALSE)),0,IF(VLOOKUP($A6,'GPIO Configuration'!$B$4:$L$97,11,FALSE)=\"1 - 使能\",1,0))","v":1},{"$f":"IF(ISNA(VLOOKUP($A6,'GPIO Configuration'!$B$4:$I$97,8,FALSE)),0,IF(VLOOKUP($A6,'GPIO Configuration'!$B$4:$I$97,8,FALSE)=\"上拉\",2,IF(VLOOKUP($A6,'GPIO Configuration'!$B$4:$I$97,8,FALSE)=\"下拉\",1,0)))","v":0},{"$f":"IF(ISNA(VLOOKUP($A6,'GPIO Configuration'!$B$4:$G$97,6,FALSE)),0,MATCH(VLOOKUP($A6,'GPIO Configuration'!$B$4:$G$97,6,FALSE),INDIRECT($A6&\"_Func\"),0)-1)","v":0},{"$f":"IF(ISNA(VLOOKUP($A6,'GPIO Configuration'!$B$4:$H$97,7,FALSE)),0,MATCH(VLOOKUP($A6,'GPIO Configuration'!$B$4:$H$97,7,FALSE),INDIRECT($A6&\"_OutDrv\"),0)-1)","v":3},{"$f":"IF(ISNA(VLOOKUP($A6,'GPIO Configuration'!$B$4:$M$97,12,FALSE)),0,IF(VLOOKUP($A6,'GPIO Configuration'!$B$4:$M$97,12,FALSE)=\"OUT - 输出\",1,0))","v":1},{"$f":"IF(ISNA(VLOOKUP($A6,'GPIO Configuration'!$B$4:$N$97,13,FALSE)),0,IF(VLOOKUP($A6,'GPIO Configuration'!$B$4:$N$97,13,FALSE)=\"1 - 高电平\",1,0))","v":0},{"$f":"IF(ISNA(VLOOKUP($A6,'GPIO Configuration'!$B$4:$S$97,18,FALSE)),0,IF(VLOOKUP($A6,'GPIO Configuration'!$B$4:$S$97,18,FALSE)=\"1 - 使能\",1,0))","v":0},{"$f":"IF(ISNA(VLOOKUP($A6,'GPIO Configuration'!$B$4:$R$97,17,FALSE)),0,MATCH(VLOOKUP($A6,'GPIO Configuration'!$B$4:$R$97,17,FALSE),INDIRECT($A6&\"_InLv\"),0)-1)","v":0},{"$f":"IF(ISNA(VLOOKUP($A6,'GPIO Configuration'!$B$4:$T$97,19,FALSE)),0,IF(VLOOKUP($A6,'GPIO Configuration'!$B$4:$T$97,19,FALSE)=\"1 - 使能\",1,0))","v":1},{"$f":"IF(ISNA(VLOOKUP($A6,'GPIO Configuration'!$B$4:$Q$97,16,FALSE)),0,IF(VLOOKUP($A6,'GPIO Configuration'!$B$4:$Q$97,16,FALSE)=\"上拉\",2,IF(VLOOKUP($A6,'GPIO Configuration'!$B$4:$Q$97,16,FALSE)=\"下拉\",1,0)))","v":0},{"$f":"IF(ISNA(VLOOKUP($A6,'GPIO Configuration'!$B$4:$O$97,14,FALSE)),0,MATCH(VLOOKUP($A6,'GPIO Configuration'!$B$4:$O$97,14,FALSE),INDIRECT($A6&\"_Func\"),0)-1)","v":0},{"$f":"IF(ISNA(VLOOKUP($A6,'GPIO Configuration'!$B$4:$P$97,15,FALSE)),0,MATCH(VLOOKUP($A6,'GPIO Configuration'!$B$4:$P$97,15,FALSE),INDIRECT($A6&\"_OutDrv\"),0)-1)","v":0}]
["P0_04",0,4,"0x0004","GPIO_PODR0_POD4","GPIO_PIDR0_PID4",{"$f":"IF(ISNA(VLOOKUP($A7,'GPIO Configuration'!$B$4:$C$97,2,FALSE)),0,1)","v":1},{"$f":"IF(ISNA(VLOOKUP($A7,'GPIO Configuration'!$B$4:$C$97,2,FALSE)),0,IF(VLOOKUP($A7,'GPIO Configuration'!$B$4:$C$97,2,FALSE)=\"是\",1,0))","v":0},{"$f":"IF(ISNA(VLOOKUP($A7,'GPIO Configuration'!$B$4:$D$97,3,FALSE)),\"\",TRIM(VLOOKUP($A7,'GPIO Configuration'!$B$4:$D$97,3,FALSE)))","v":""},{"$f":"IF(ISNA(VLOOKUP($A7,'GPIO Configuration'!$B$4:$E$97,4,FALSE)),0,IF(VLOOKUP($A7,'GPIO Configuration'!$B$4:$E$97,4,FALSE)=\"OUT - 输出\",1,0))","v":1},{"$f":"IF(ISNA(VLOOKUP($A7,'GPIO Configuration'!$B$4:$F$97,5,FALSE)),0,IF(VLOOKUP($A7,'GPIO Configuration'!$B$4:$F$97,5,FALSE)=\"1 - 高电平\",1,0))","v":0},{"$f":"IF(ISNA(VLOOKUP($A7,'GPIO Configuration'!$B$4:$K$97,10,FALSE)),0,IF(VLOOKUP($A7,'GPIO Configuration'!$B$4:$K$97,10,FALSE)=\"1 - 使能\",1,0))","v":0},{"$f":"IF(ISNA(VLOOKUP($A7,'GPIO Configuration'!$B$4:$J$97,9,FALSE)),0,MATCH(VLOOKUP($A7,'GPIO Configuration'!$B$4:$J$97,9,FALSE),INDIRECT($A7&\"_InLv\"),0)-1)","v":0},{"$f":"IF(ISNA(VLOOKUP($A7,'GPIO Configuration'!$B$4:$L$97,11,FALSE)),0,IF(VLOOKUP($A7,'GPIO Configuration'!$B$4:$L$97,11,FALSE)=\"1 - 使能\",1,0))","v":1},{"$f":"IF(ISNA(VLOOKUP($A7,'GPIO Configuration'!$B$4:$I$97,8,FALSE)),0,IF(VLOOKUP($A7,'GPIO Configuration'!$B$4:$I$97,8,FALSE)=\"上拉\",2,IF(VLOOKUP($A7,'GPIO Configuration'!$B$4:$I$97,8,FALSE)=\"下拉\",1,0)))","v":0},{"$f":"IF(ISNA(VLOOKUP($A7,'GPIO Configuration'!$B$4:$G$97,6,FALSE)),0,MATCH(VLOOKUP($A7,'GPIO Configuration'!$B$4:$G$97,6,FALSE),INDIRECT($A7&\"_Func\"),0)-1)","v":0},{"$f":"IF(ISNA(VLOOKUP($A7,'GPIO Configuration'!$B$4:$H$97,7,FALSE)),0,MATCH(VLOOKUP($A7,'GPIO Configuration'!$B$4:$H$97,7,FALSE),INDIRECT($A7&\"_OutDrv\"),0)-1)","v":3},{"$f":"IF(ISNA(VLOOKUP($A7,'GPIO Configuration'!$B$4:$M$97,12,FALSE)),0,IF(VLOOKUP($A7,'GPIO Configuration'!$B$4:$M$97,12,FALSE)=\"OUT - 输出\",1,0))","v":1},{"$f":"IF(ISNA(VLOOKUP($A7,'GPIO Configuration'!$B$4:$N$97,13,FALSE)),0,IF(VLOOKUP($A7,'GPIO Configuration'!$B$4:$N$97,13,FALSE)=\"1 - 高电平\",1,0))","v":0},{"$f":"IF(ISNA(VLOOKUP($A7,'GPIO Configuration'!$B$4:$S$97,18,FALSE)),0,IF(VLOOKUP($A7,'GPIO Configuration'!$B$4:$S$97,18,FALSE)=\"1 - 使能\",1,0))","v":0},{"$f":"IF(ISNA(VLOOKUP($A7,'GPIO Configuration'!$B$4:$R$97,17,FALSE)),0,MATCH(VLOOKUP($A7,'GPIO Configuration'!$B$4:$R$97,17,FALSE),INDIRECT($A7&\"_InLv\"),0)-1)","v":0},{"$f":"IF(ISNA(VLOOKUP($A7,'GPIO Configuration'!$B$4:$T$97,19,FALSE)),0,IF(VLOOKUP($A7,'GPIO Configuration'!$B$4:$T$97,19,FALSE)=\"1 - 使能\",1,0))","v":1},{"$f":"IF(ISNA(VLOOKUP($A7,'GPIO Configuration'!$B$4:$Q$97,16,FALSE)),0,IF(VLOOKUP($A7,'GPIO Configuration'!$B$4:$Q$97,16,FALSE)=\"上拉\",2,IF(VLOOKUP($A7,'GPIO Configuration'!$B$4:$Q$97,16,FALSE)=\"下拉\",1,0)))","v":0},{"$f":"IF(ISNA(VLOOKUP($A7,'GPIO Configuration'!$B$4:$O$97,14,FALSE)),0,MATCH(VLOOKUP($A7,'GPIO Configuration'!$B$4:$O$97,14,FALSE),INDIRECT($A7&\"_Func\"),0)-1)","v":0},{"$f":"IF(ISNA(VLOOKUP($A7,'GPIO Configuration'!$B$4:$P$97,15,FALSE)),0,MATCH(VLOOKUP($A7,'GPIO Configuration'!$B$4:$P$97,15,FALSE),INDIRECT($A7&\"_OutDrv\"),0)-1)","v":0}]
["P0_05",0,5,"0x0005","GPIO_PODR0_POD5","GPIO_PIDR0_PID5",{"$f":"IF(ISNA(VLOOKUP($A8,'GPIO Configuration'!$B$4:$C$97,2,FALSE)),0,1)","v":1},{"$f":"IF(ISNA(VLOOKUP($A8,'GPIO Configuration'!$B$4:$C$97,2,FALSE)),0,IF(VLOOKUP($A8,'GPIO Configuration'!$B$4:$C$97,2,FALSE)=\"是\",1,0))","v":0},{"$f":"IF(ISNA(VLOOKUP($A8,'GPIO Configuration'!$B$4:$D$97,3,FALSE)),\"\",TRIM(VLOOKUP($A8,'GPIO Configuration'!$B$4:$D$97,3,FALSE)))","v":""},{"$f":"IF(ISNA(VLOOKUP($A8,'GPIO Configuration'!$B$4:$E$97,4,FALSE)),0,IF(VLOOKUP($A8,'GPIO Configuration'!$B$4:$E$97,4,FALSE)=\"OUT - 输出\",1,0))","v":1},{"$f":"IF(ISNA(VLOOKUP($A8,'GPIO Configuration'!$B$4:$F$97,5,FALSE)),0,IF(VLOOKUP($A8,'GPIO Configuration'!$B$4:$F$97,5,FALSE)=\"1 - 高电平\",1,0))","v":1},{"$f":"IF(ISNA(VLOOKUP($A8,'GPIO Configuration'!$B$4:$K$97,10,FALSE)),0,IF(VLOOKUP($A8,'GPIO Configuration'!$B$4:$K$97,10,FALSE)=\"1 - 使能\",1,0))","v":0},{"$f":"IF(ISNA(VLOOKUP($A8,'GPIO Configuration'!$B$4:$J$97,9,FALSE)),0,MATCH(VLOOKUP($A8,'GPIO Configuration'!$B$4:$J$97,9,FALSE),INDIRECT($A8&\"_InLv\"),0)-1)","v":0},{"$f":"IF(ISNA(VLOOKUP($A8,'GPIO Configuration'!$B$4:$L$97,11,FALSE)),0,IF(VLOOKUP($A8,'GPIO Configuration'!$B$4:$L$97,11,FALSE)=\"1 - 使能\",1,0))","v":1},{"$f":"IF(ISNA(VLOOKUP($A8,'GPIO Configuration'!$B$4:$I$97,8,FALSE)),0,IF(VLOOKUP($A8,'GPIO Configuration'!$B$4:$I$97,8,FALSE)=\"上拉\",2,IF(VLOOKUP($A8,'GPIO Configuration'!$B$4:$I$97,8,FALSE)=\"下拉\",1,0)))","v":0},{"$f":"IF(ISNA(VLOOKUP($A8,'GPIO Configuration'!$B$4:$G$97,6,FALSE)),0,MATCH(VLOOKUP($A8,'GPIO Configuration'!$B$4:$G$97,6,FALSE),INDIRECT($A8&\"_Func\"),0)-1)","v":0},{"$f":"IF(ISNA(VLOOKUP($A8,'GPIO Configuration'!$B$4:$H$97,7,FALSE)),0,MATCH(VLOOKUP($A8,'GPIO Configuration'!$B$4:$H$97,7,FALSE),INDIRECT($A8&\"_OutDrv\"),0)-1)","v":3},{"$f":"IF(ISNA(VLOOKUP($A8,'GPIO Configuration'!$B$4:$M$97,12,FALSE)),0,IF(VLOOKUP($A8,'GPIO Configuration'!$B$4:$M$97,12,FALSE)=\"OUT - 输出\",1,0))","v":1},{"$f":"IF(ISNA(VLOOKUP($A8,'GPIO Configuration'!$B$4:$N$97,13,FALSE)),0,IF(VLOOKUP($A8,'GPIO Configuration'!$B$4:$N$97,13,FALSE)=\"1 - 高电平\",1,0))","v":0},{"$f":"IF(ISNA(VLOOKUP($A8,'GPIO Configuration'!$B$4:$S$97,18,FALSE)),0,IF(VLOOKUP($A8,'GPIO Configuration'!$B$4:$S$97,18,FALSE)=\"1 - 使能\",1,0))","v":0},{"$f":"IF(ISNA(VLOOKUP($A8,'GPIO Configuration'!$B$4:$R$97,17,FALSE)),0,MATCH(VLOOKUP($A8,'GPIO Configuration'!$B$4:$R$97,17,FALSE),INDIRECT($A8&\"_InLv\"),0)-1)","v":0},{"$f":"IF(ISNA(VLOOKUP($A8,'GPIO Configuration'!$B$4:$T$97,19,FALSE)),0,IF(VLOOKUP($A8,'GPIO Configuration'!$B$4:$T$97,19,FALSE)=\"1 - 使能\",1,0))","v":1},{"$f":"IF(ISNA(VLOOKUP($A8,'GPIO Configuration'!$B$4:$Q$97,16,FALSE)),0,IF(VLOOKUP($A8,'GPIO Configuration'!$B$4:$Q$97,16,FALSE)=\"上拉\",2,IF(VLOOKUP($A8,'GPIO Configuration'!$B$4:$Q$97,16,FALSE)=\"下拉\",1,0)))","v":0},{"$f":"IF(ISNA(VLOOKUP($A8,'GPIO Configuration'!$B$4:$O$97,14,FALSE)),0,MATCH(VLOOKUP($A8,'GPIO Configuration'!$B$4:$O$97,14,FALSE),INDIRECT($A8&\"_Func\"),0)-1)","v":0},{"$f":"IF(ISNA(VLOOKUP($A8,'GPIO Configuration'!$B$4:$P$97,15,FALSE)),0,MATCH(VLOOKUP($A8,'GPIO Configuration'!$B$4:$P$97,15,FALSE),INDIRECT($A8&\"_OutDrv\"),0)-1)","v":0}]
["P0_06",0,6,"0x0006","GPIO_PODR0_POD6","GPIO_PIDR0_PID6",{"$f":"IF(ISNA(VLOOKUP($A9,'GPIO Configuration'!$B$4:$C$97,2,FALSE)),0,1)","v":1},{"$f":"IF(ISNA(VLOOKUP($A9,'GPIO Configuration'!$B$4:$C$97,2,FALSE)),0,IF(VLOOKUP($A9,'GPIO Configuration'!$B$4:$C$97,2,FALSE)=\"是\",1,0))","v":1},{"$f":"IF(ISNA(VLOOKUP($A9,'GPIO Configuration'!$B$4:$D$97,3,FALSE)),\"\",TRIM(VLOOKUP($A9,'GPIO Configuration'!$B$4:$D$97,3,FALSE)))","v":"Sensor_5V_OUT"},{"$f":"IF(ISNA(VLOOKUP($A9,'GPIO Configuration'!$B$4:$E$97,4,FALSE)),0,IF(VLOOKUP($A9,'GPIO Configuration'!$B$4:$E$97,4,FALSE)=\"OUT - 输出\",1,0))","v":1},{"$f":"IF(ISNA(VLOOKUP($A9,'GPIO Configuration'!$B$4:$F$97,5,FALSE)),0,IF(VLOOKUP($A9,'GPIO Configuration'!$B$4:$F$97,5,FALSE)=\"1 - 高电平\",1,0))","v":0},{"$f":"IF(ISNA(VLOOKUP($A9,'GPIO Configuration'!$B$4:$K$97,10,FALSE)),0,IF(VLOOKUP($A9,'GPIO Configuration'!$B$4:$K$97,10,FALSE)=\"1 - 使能\",1,0))","v":0},{"$f":"IF(ISNA(VLOOKUP($A9,'GPIO Configuration'!$B$4:$J$97,9,FALSE)),0,MATCH(VLOOKUP($A9,'GPIO Configuration'!$B$4:$J$97,9,FALSE),INDIRECT($A9&\"_InLv\"),0)-1)","v":0},{"$f":"IF(ISNA(VLOOKUP($A9,'GPIO Configuration'!$B$4:$L$97,11,FALSE)),0,IF(VLOOKUP($A9,'GPIO Configuration'!$B$4:$L$97,11,FALSE)=\"1 - 使能\",1,0))","v":1},{"$f":"IF(ISNA(VLOOKUP($A9,'GPIO Configuration'!$B$4:$I$97,8,FALSE)),0,IF(VLOOKUP($A9,'GPIO Configuration'!$B$4:$I$97,8,FALSE)=\"上拉\",2,IF(VLOOKUP($A9,'GPIO Configuration'!$B$4:$I$97,8,FALSE)=\"下拉\",1,0)))","v":0},{"$f":"IF(ISNA(VLOOKUP($A9,'GPIO Configuration'!$B$4:$G$97,6,FALSE)),0,MATCH(VLOOKUP($A9,'GPIO Configuration'!$B$4:$G$97,6,FALSE),INDIRECT($A9&\"_Func\"),0)-1)","v":0},{"$f":"IF(ISNA(VLOOKUP($A9,'GPIO Configuration'!$B$4:$H$97,7,FALSE)),0,MATCH(VLOOKUP($A9,'GPIO Configuration'!$B$4:$H$97,7,FALSE),INDIRECT($A9&\"_OutDrv\"),0)-1)","v":3},{"$f":"IF(ISNA(VLOOKUP($A9,'GPIO Configuration'!$B$4:$M$97,12,FALSE)),0,IF(VLOOKUP($A9,'GPIO Configuration'!$B$4:$M$97,12,FALSE)=\"OUT - 输出\",1,0))","v":1},{"$f":"IF(ISNA(VLOOKUP($A9,'GPIO Configuration'!$B$4:$N$97,13,FALSE)),0,IF(VLOOKUP($A9,'GPIO Configuration'!$B$4:$N$97,13,FALSE)=\"1 - 高电平\",1,0))","v":1},{"$f":"IF(ISNA(VLOOKUP($A9,'GPIO Configuration'!$B$4:$S$97,18,FALSE)),0,IF(VLOOKUP($A9,'GPIO Configuration'!$B$4:$S$97,18,FALSE)=\"1 - 使能\",1,0))","v":0},{"$f":"IF(ISNA(VLOOKUP($A9,'GPIO Configuration'!$B$4:$R$97,17,FALSE)),0,MATCH(VLOOKUP($A9,'GPIO Configuration'!$B$4:$R$97,17,FALSE),INDIRECT($A9&\"_InLv\"),0)-1)","v":0},{"$f":"IF(ISNA(VLOOKUP($A9,'GPIO Configuration'!$B$4:$T$97,19,FALSE)),0,IF(VLOOKUP($A9,'GPIO Configuration'!$B$4:$T$97,19,FALSE)=\"1 - 使能\",1,0))","v":1},{"$f":"IF(ISNA(VLOOKUP($A9,'GPIO Configuration'!$B$4:$Q$97,16,FALSE)),0,IF(VLOOKUP($A9,'GPIO Configuration'!$B$4:$Q$97,16,FALSE)=\"上拉\",2,IF(VLOOKUP($A9,'GPIO Configuration'!$B$4:$Q$97,16,FALSE)=\"下拉\",1,0)))","v":0},{"$f":"IF(ISNA(VLOOKUP($A9,'GPIO Configuration'!$B$4:$O$97,14,FALSE)),0,MATCH(VLOOKUP($A9,'GPIO Configuration'!$B$4:$O$97,14,FALSE),INDIRECT($A9&\"_Func\"),0)-1)","v":0},{"$f":"IF(ISNA(VLOOKUP($A9,'GPIO Configuration'!$B$4:$P$97,15,FALSE)),0,MATCH(VLOOKUP($A9,'GPIO Configuration'!$B$4:$P$97,15,FALSE),INDIRECT($A9&\"_OutDrv\"),0)-1)","v":0}]
["P0_07",0,7,"0x0007","GPIO_PODR0_POD7","GPIO_PIDR0_PID7",{"$f":"IF(ISNA(VLOOKUP($A10,'GPIO Configuration'!$B$4:$C$97,2,FALSE)),0,1)","v":1},{"$f":"IF(ISNA(VLOOKUP($A10,'GPIO Configuration'!$B$4:$C$97,2,FALSE)),0,IF(VLOOKUP($A10,'GPIO Configuration'!$B$4:$C$97,2,FALSE)=\"是\",1,0))","v":0},{"$f":"IF(ISNA(VLOOKUP($A10,'GPIO Configuration'!$B$4:$D$97,3,FALSE)),\"\",TRIM(VLOOKUP($A10,'GPIO Configuration'!$B$4:$D$97,3,FALSE)))","v":""},{"$f":"IF(ISNA(VLOOKUP($A10,'GPIO Configuration'!$B$4:$E$97,4,FALSE)),0,IF(VLOOKUP($A10,'GPIO Configuration'!$B$4:$E$97,4,FALSE)=\"OUT - 输出\",1,0))","v":1},{"$f":"IF(ISNA(VLOOKUP($A10,'GPIO Configuration'!$B$4:$F$97,5,FALSE)),0,IF(VLOOKUP($A10,'GPIO Configuration'!$B$4:$F$97,5,FALSE)=\"1 - 高电平\",1,0))","v":0},{"$f":"IF(ISNA(VLOOKUP($A10,'GPIO Configuration'!$B$4:$K$97,10,FALSE)),0,IF(VLOOKUP($A10,'GPIO Configuration'!$B$4:$K$97,10,FALSE)=\"1 - 使能\",1,0))","v":0},{"$f":"IF(ISNA(VLOOKUP($A10,'GPIO Configuration'!$B$4:$J$97,9,FALSE)),0,MATCH(VLOOKUP($A10,'GPIO Configuration'!$B$4:$J$97,9,FALSE),INDIRECT($A10&\"_InLv\"),0)-1)","v":0},{"$f":"IF(ISNA(VLOOKUP($A10,'GPIO Configuration'!$B$4:$L$97,11,FALSE)),0,IF(VLOOKUP($A10,'GPIO Configuration'!$B$4:$L$97,11,FALSE)=\"1 - 使能\",1,0))","v":1},{"$f":"IF(ISNA(VLOOKUP($A10,'GPIO Configuration'!$B$4:$I$97,8,FALSE)),0,IF(VLOOKUP($A10,'GPIO Configuration'!$B$4:$I$97,8,FALSE)=\"上拉\",2,IF(VLOOKUP($A10,'GPIO Configuration'!$B$4:$I$97,8,FALSE)=\"下拉\",1,0)))","v":0},{"$f":"IF(ISNA(VLOOKUP($A10,'GPIO Configuration'!$B$4:$G$97,6,FALSE)),0,MATCH(VLOOKUP($A10,'GPIO Configuration'!$B$4:$G$97,6,FALSE),INDIRECT($A10&\"_Func\"),0)-1)","v":0},{"$f":"IF(ISNA(VLOOKUP($A10,'GPIO Configuration'!$B$4:$H$97,7,FALSE)),0,MATCH(VLOOKUP($A10,'GPIO Configuration'!$B$4:$H$97,7,FALSE),INDIRECT($A10&\"_OutDrv\"),0)-1)","v":3},{"$f":"IF(ISNA(VLOOKUP($A10,'GPIO Configuration'!$B$4:$M$97,12,FALSE)),0,IF(VLOOKUP($A10,'GPIO Configuration'!$B$4:$M$97,12,FALSE)=\"OUT - 输出\",1,0))","v":1},{"$f":"IF(ISNA(VLOOKUP($A10,'GPIO Configuration'!$B$4:$N$97,13,FALSE)),0,IF(VLOOKUP($A10,'GPIO Configuration'!$B$4:$N$97,13,FALSE)=\"1 - 高电平\",1,0))","v":0},{"$f":"IF(ISNA(VLOOKUP($A10,'GPIO Configuration'!$B$4:$S$97,18,FALSE)),0,IF(VLOOKUP($A10,'GPIO Configuration'!$B$4:$S$97,18,FALSE)=\"1 - 使能\",1,0))","v":0},{"$f":"IF(ISNA(VLOOKUP($A10,'GPIO Configuration'!$B$4:$R$97,17,FALSE)),0,MATCH(VLOOKUP($A10,'GPIO Configuration'!$B$4:$R$97,17,FALSE),INDIRECT($A10&\"_InLv\"),0)-1)","v":0},{"$f":"IF(ISNA(VLOOKUP($A10,'GPIO Configuration'!$B$4:$T$97,19,FALSE)),0,IF(VLOOKUP($A10,'GPIO Configuration'!$B$4:$T$97,19,FALSE)=\"1 - 使能\",1,0))","v":1},{"$f":"IF(ISNA(VLOOKUP($A10,'GPIO Configuration'!$B$4:$Q$97,16,FALSE)),0,IF(VLOOKUP($A10,'GPIO Configuration'!$B$4:$Q$97,16,FALSE)=\"上拉\",2,IF(VLOOKUP($A10,'GPIO Configuration'!$B$4:$Q$97,16,FALSE)=\"下拉\",1,0)))","v":0},{"$f":"IF(ISNA(VLOOKUP($A10,'GPIO Configuration'!$B$4:$O$97,14,FALSE)),0,MATCH(VLOOKUP($A10,'GPIO Configuration'!$B$4:$O$97,14,FALSE),INDIRECT($A10&\"_Func\"),0)-1)","v":0},{"$f":"IF(ISNA(VLOOKUP($A10,'GPIO Configuration'!$B$4:$P$97,15,FALSE)),0,MATCH(VLOOKUP($A10,'GPIO Configuration'!$B$4:$P$97,15,FALSE),INDIRECT($A10&\"_OutDrv\"),0)-1)","v":0}]
["P0_08",0,8,"0x0008","GPIO_PODR0_POD8","GPIO_PIDR0_PID8",{"$f":"IF(ISNA(VLOOKUP($A11,'GPIO Configuration'!$B$4:$C$97,2,FALSE)),0,1)","v":1},{"$f":"IF(ISNA(VLOOKUP($A11,'GPIO Configuration'!$B$4:$C$97,2,FALSE)),0,IF(VLOOKUP($A11,'GPIO Configuration'!$B$4:$C$97,2,FALSE)=\"是\",1,0))","v":0},{"$f":"IF(ISNA(VLOOKUP($A11,'GPIO Configuration'!$B$4:$D$97,3,FALSE)),\"\",TRIM(VLOOKUP($A11,'GPIO Configuration'!$B$4:$D$97,3,FALSE)))","v":""},{"$f":"IF(ISNA(VLOOKUP($A11,'GPIO Configuration'!$B$4:$E$97,4,FALSE)),0,IF(VLOOKUP($A11,'GPIO Configuration'!$B$4:$E$97,4,FALSE)=\"OUT - 输出\",1,0))","v":1},{"$f":"IF(ISNA(VLOOKUP($A11,'GPIO Configuration'!$B$4:$F$97,5,FALSE)),0,IF(VLOOKUP($A11,'GPIO Configuration'!$B$4:$F$97,5,FALSE)=\"1 - 高电平\",1,0))","v":0},{"$f":"IF(ISNA(VLOOKUP($A11,'GPIO Configuration'!$B$4:$K$97,10,FALSE)),0,IF(VLOOKUP($A11,'GPIO Configuration'!$B$4:$K$97,10,FALSE)=\"1 - 使能\",1,0))","v":0},{"$f":"IF(ISNA(VLOOKUP($A11,'GPIO Configuration'!$B$4:$J$97,9,FALSE)),0,MATCH(VLOOKUP($A11,'GPIO Configuration'!$B$4:$J$97,9,FALSE),INDIRECT($A11&\"_InLv\"),0)-1)","v":0},{"$f":"IF(ISNA(VLOOKUP($A11,'GPIO Configuration'!$B$4:$L$97,11,FALSE)),0,IF(VLOOKUP($A11,'GPIO Configuration'!$B$4:$L$97,11,FALSE)=\"1 - 使能\",1,0))","v":1},{"$f":"IF(ISNA(VLOOKUP($A11,'GPIO Configuration'!$B$4:$I$97,8,FALSE)),0,IF(VLOOKUP($A11,'GPIO Configuration'!$B$4:$I$97,8,FALSE)=\"上拉\",2,IF(VLOOKUP($A11,'GPIO Configuration'!$B$4:$I$97,8,FALSE)=\"下拉\",1,0)))","v":0},{"$f":"IF(ISNA(VLOOKUP($A11,'GPIO Configuration'!$B$4:$G$97,6,FALSE)),0,MATCH(VLOOKUP($A11,'GPIO Configuration'!$B$4:$G$97,6,FALSE),INDIRECT($A11&\"_Func\"),0)-1)","v":0},{"$f":"IF(ISNA(VLOOKUP($A11,'GPIO Configuration'!$B$4:$H$97,7,FALSE)),0,MATCH(VLOOKUP($A11,'GPIO Configuration'!$B$4:$H$97,7,FALSE),INDIRECT($A11&\"_OutDrv\"),0)-1)","v":3},{"$f":"IF(ISNA(VLOOKUP($A11,'GPIO Configuration'!$B$4:$M$97,12,FALSE)),0,IF(VLOOKUP($A11,'GPIO Configuration'!$B$4:$M$97,12,FALSE)=\"OUT - 输出\",1,0))","v":1},{"$f":"IF(ISNA(VLOOKUP($A11,'GPIO Configuration'!$B$4:$N$97,13,FALSE)),0,IF(VLOOKUP($A11,'GPIO Configuration'!$B$4:$N$97,13,FALSE)=\"1 - 高电平\",1,0))","v":0},{"$f":"IF(ISNA(VLOOKUP($A11,'GPIO Configuration'!$B$4:$S$97,18,FALSE)),0,IF(VLOOKUP($A11,'GPIO Configuration'!$B$4:$S$97,18,FALSE)=\"1 - 使能\",1,0))","v":0},{"$f":"IF(ISNA(VLOOKUP($A11,'GPIO Configuration'!$B$4:$R$97,17,FALSE)),0,MATCH(VLOOKUP($A11,'GPIO Configuration'!$B$4:$R$97,17,FALSE),INDIRECT($A11&\"_InLv\"),0)-1)","v":0},{"$f":"IF(ISNA(VLOOKUP($A11,'GPIO Configuration'!$B$4:$T$97,19,FALSE)),0,IF(VLOOKUP($A11,'GPIO Configuration'!$B$4:$T$97,19,FALSE)=\"1 - 使能\",1,0))","v":1},{"$f":"IF(ISNA(VLOOKUP($A11,'GPIO Configuration'!$B$4:$Q$97,16,FALSE)),0,IF(VLOOKUP($A11,'GPIO Configuration'!$B$4:$Q$97,16,FALSE)=\"上拉\",2,IF(VLOOKUP($A11,'GPIO Configuration'!$B$4:$Q$97,16,FALSE)=\"下拉\",1,0)))","v":0},{"$f":"IF(ISNA(VLOOKUP($A11,'GPIO Configuration'!$B$4:$O$97,14,FALSE)),0,MATCH(VLOOKUP($A11,'GPIO Configuration'!$B$4:$O$97,14,FALSE),INDIRECT($A11&\"_Func\"),0)-1)","v":0},{"$f":"IF(ISNA(VLOOKUP($A11,'GPIO Configuration'!$B$4:$P$97,15,FALSE)),0,MATCH(VLOOKUP($A11,'GPIO Configuration'!$B$4:$P$97,15,FALSE),INDIRECT($A11&\"_OutDrv\"),0)-1)","v":0}]
["P0_09",0,9,"0x0009","GPIO_PODR0_POD9","GPIO_PIDR0_PID9",{"$f":"IF(ISNA(VLOOKUP($A12,'GPIO Configuration'!$B$4:$C$97,2,FALSE)),0,1)","v":1},{"$f":"IF(ISNA(VLOOKUP($A12,'GPIO Configuration'!$B$4:$C$97,2,FALSE)),0,IF(VLOOKUP($A12,'GPIO Configuration'!$B$4:$C$97,2,FALSE)=\"是\",1,0))","v":0},{"$f":"IF(ISNA(VLOOKUP($A12,'GPIO Configuration'!$B$4:$D$97,3,FALSE)),\"\",TRIM(VLOOKUP($A12,'GPIO Configuration'!$B$4:$D$97,3,FALSE)))","v":""},{"$f":"IF(ISNA(VLOOKUP($A12,'GPIO Configuration'!$B$4:$E$97,4,FALSE)),0,IF(VLOOKUP($A12,'GPIO Configuration'!$B$4:$E$97,4,FALSE)=\"OUT - 输出\",1,0))","v":0},{"$f":"IF(ISNA(VLOOKUP($A12,'GPIO Configuration'!$B$4:$F$97,5,FALSE)),0,IF(VLOOKUP($A12,'GPIO Configuration'!$B$4:$F$97,5,FALSE)=\"1 - 高电平\",1,0))","v":0},{"$f":"IF(ISNA(VLOOKUP($A12,'GPIO Configuration'!$B$4:$K$97,10,FALSE)),0,IF(VLOOKUP($A12,'GPIO Configuration'!$B$4:$K$97,10,FALSE)=\"1 - 使能\",1,0))","v":1},{"$f":"IF(ISNA(VLOOKUP($A12,'GPIO Configuration'!$B$4:$J$97,9,FALSE)),0,MATCH(VLOOKUP($A12,'GPIO Configuration'!$B$4:$J$97,9,FALSE),INDIRECT($A12&\"_InLv\"),0)-1)","v":0},{"$f":"IF(ISNA(VLOOKUP($A12,'GPIO Configuration'!$B$4:$L$97,11,FALSE)),0,IF(VLOOKUP($A12,'GPIO Configuration'!$B$4:$L$97,11,FALSE)=\"1 - 使能\",1,0))","v":1},{"$f":"IF(ISNA(VLOOKUP($A12,'GPIO Configuration'!$B$4:$I$97,8,FALSE)),0,IF(VLOOKUP($A12,'GPIO Configuration'!$B$4:$I$97,8,FALSE)=\"上拉\",2,IF(VLOOKUP($A12,'GPIO Configuration'!$B$4:$I$97,8,FALSE)=\"下拉\",1,0)))","v":0},{"$f":"IF(ISNA(VLOOKUP($A12,'GPIO Configuration'!$B$4:$G$97,6,FALSE)),0,MATCH(VLOOKUP($A12,'GPIO Configuration'!$B$4:$G$97,6,FALSE),INDIRECT($A12&\"_Func\"),0)-1)","v":0},{"$f":"IF(ISNA(VLOOKUP($A12,'GPIO Configuration'!$B$4:$H$97,7,FALSE)),0,MATCH(VLOOKUP($A12,'GPIO Configuration'!$B$4:$H$97,7,FALSE),INDIRECT($A12&\"_OutDrv\"),0)-1)","v":3},{"$f":"IF(ISNA(VLOOKUP($A12,'GPIO Configuration'!$B$4:$M$97,12,FALSE)),0,IF(VLOOKUP($A12,'GPIO Configuration'!$B$4:$M$97,12,FALSE)=\"OUT - 输出\",1,0))","v":0},{"$f":"IF(ISNA(VLOOKUP($A12,'GPIO Configuration'!$B$4:$N$97,13,FALSE)),0,IF(VLOOKUP($A12,'GPIO Configuration'!$B$4:$N$97,13,FALSE)=\"1 - 高电平\",1,0))","v":0},{"$f":"IF(ISNA(VLOOKUP($A12,'GPIO Configuration'!$B$4:$S$97,18,FALSE)),0,IF(VLOOKUP($A12,'GPIO Configuration'!$B$4:$S$97,18,FALSE)=\"1 - 使能\",1,0))","v":0},{"$f":"IF(ISNA(VLOOKUP($A12,'GPIO Configuration'!$B$4:$R$97,17,FALSE)),0,MATCH(VLOOKUP($A12,'GPIO Configuration'!$B$4:$R$97,17,FALSE),INDIRECT($A12&\"_InLv\"),0)-1)","v":0},{"$f":"IF(ISNA(VLOOKUP($A12,'GPIO Configuration'!$B$4:$T$97,19,FALSE)),0,IF(VLOOKUP($A12,'GPIO Configuration'!$B$4:$T$97,19,FALSE)=\"1 - 使能\",1,0))","v":1},{"$f":"IF(ISNA(VLOOKUP($A12,'GPIO Configuration'!$B$4:$Q$97,16,FALSE)),0,IF(VLOOKUP($A12,'GPIO Configuration'!$B$4:$Q$97,16,FALSE)=\"上拉\",2,IF(VLOOKUP($A12,'GPIO Configuration'!$B$4:$Q$97,16,FALSE)=\"下拉\",1,0)))","v":0},{"$f":"IF(ISNA(VLOOKUP($A12,'GPIO Configuration'!$B$4:$O$97,14,FALSE)),0,MATCH(VLOOKUP($A12,'GPIO Configuration'!$B$4:$O$97,14,FALSE),INDIRECT($A12&\"_Func\"),0)-1)","v":0},{"$f":"IF(ISNA(VLOOKUP($A12,'GPIO Configuration'!$B$4:$P$97,15,FALSE)),0,MATCH(VLOOKUP($A12,'GPIO Configuration'!$B$4:$P$97,15,FALSE),INDIRECT($A12&\"_OutDrv\"),0)-1)","v":0}]
["P0_10",0,10,"0x000A","GPIO_PODR0_POD10","GPIO_PIDR0_PID10",{"$f":"IF(ISNA(VLOOKUP($A13,'GPIO Configuration'!$B$4:$C$97,2,FALSE)),0,1)","v":1},{"$f":"IF(ISNA(VLOOKUP($A13,'GPIO Configuration'!$B$4:$C$97,2,FALSE)),0,IF(VLOOKUP($A13,'GPIO Configuration'!$B$4:$C$97,2,FALSE)=\"是\",1,0))","v":1},{"$f":"IF(ISNA(VLOOKUP($A13,'GPIO Configuration'!$B$4:$D$97,3,FALSE)),\"\",TRIM(VLOOKUP($A13,'GPIO Configuration'!$B$4:$D$97,3,FALSE)))","v":"Line_In_Bluetooth"},{"$f":"IF(ISNA(VLOOKUP($A13,'GPIO Configuration'!$B$4:$E$97,4,FALSE)),0,IF(VLOOKUP($A13,'GPIO Configuration'!$B$4:$E$97,4,FALSE)=\"OUT - 输出\",1,0))","v":0},{"$f":"IF(ISNA(VLOOKUP($A13,'GPIO Configuration'!$B$4:$F$97,5,FALSE)),0,IF(VLOOKUP($A13,'GPIO Configuration'!$B$4:$F$97,5,FALSE)=\"1 - 高电平\",1,0))","v":0},{"$f":"IF(ISNA(VLOOKUP($A13,'GPIO Configuration'!$B$4:$K$97,10,FALSE)),0,IF(VLOOKUP($A13,'GPIO Configuration'!$B$4:$K$97,10,FALSE)=\"1 - 使能\",1,0))","v":1},{"$f":"IF(ISNA(VLOOKUP($A13,'GPIO Configuration'!$B$4:$J$97,9,FALSE)),0,MATCH(VLOOKUP($A13,'GPIO Configuration'!$B$4:$J$97,9,FALSE),INDIRECT($A13&\"_InLv\"),0)-1)","v":0},{"$f":"IF(ISNA(VLOOKUP($A13,'GPIO Configuration'!$B$4:$L$97,11,FALSE)),0,IF(VLOOKUP($A13,'GPIO Configuration'!$B$4:$L$97,11,FALSE)=\"1 - 使能\",1,0))","v":1},{"$f":"IF(ISNA(VLOOKUP($A13,'GPIO Configuration'!$B$4:$I$97,8,FALSE)),0,IF(VLOOKUP($A13,'GPIO Configuration'!$B$4:$I$97,8,FALSE)=\"上拉\",2,IF(VLOOKUP($A13,'GPIO Configuration'!$B$4:$I$97,8,FALSE)=\"下拉\",1,0)))","v":0},{"$f":"IF(ISNA(VLOOKUP($A13,'GPIO Configuration'!$B$4:$G$97,6,FALSE)),0,MATCH(VLOOKUP($A13,'GPIO Configuration'!$B$4:$G$97,6,FALSE),INDIRECT($A13&\"_Func\"),0)-1)","v":0},{"$f":"IF(ISNA(VLOOKUP($A13,'GPIO Configuration'!$B$4:$H$97,7,FALSE)),0,MATCH(VLOOKUP($A13,'GPIO Configuration'!$B$4:$H$97,7,FALSE),INDIRECT($A13&\"_OutDrv\"),0)-1)","v":3},{"$f":"IF(ISNA(VLOOKUP($A13,'GPIO Configuration'!$B$4:$M$97,12,FALSE)),0,IF(VLOOKUP($A13,'GPIO Configuration'!$B$4:$M$97,12,FALSE)=\"OUT - 输出\",1,0))","v":0},{"$f":"IF(ISNA(VLOOKUP($A13,'GPIO Configuration'!$B$4:$N$97,13,FALSE)),0,IF(VLOOKUP($A13,'GPIO Configuration'!$B$4:$N$97,13,FALSE)=\"1 - 高电平\",1,0))","v":0},{"$f":"IF(ISNA(VLOOKUP($A13,'GPIO Configuration'!$B$4:$S$97,18,FALSE)),0,IF(VLOOKUP($A13,'GPIO Configuration'!$B$4:$S$97,18,FALSE)=\"1 - 使能\",1,0))","v":0},{"$f":"IF(ISNA(VLOOKUP($A13,'GPIO Configuration'!$B$4:$R$97,17,FALSE)),0,MATCH(VLOOKUP($A13,'GPIO Configuration'!$B$4:$R$97,17,FALSE),INDIRECT($A13&\"_InLv\"),0)-1)","v":0},{"$f":"IF(ISNA(VLOOKUP($A13,'GPIO Configuration'!$B$4:$T$97,19,FALSE)),0,IF(VLOOKUP($A13,'GPIO Configuration'!$B$4:$T$97,19,FALSE)=\"1 - 使能\",1,0))","v":1},{"$f":"IF(ISNA(VLOOKUP($A13,'GPIO Configuration'!$B$4:$Q$97,16,FALSE)),0,IF(VLOOKUP($A13,'GPIO Configuration'!$B$4:$Q$97,16,FALSE)=\"上拉\",2,IF(VLOOKUP($A13,'GPIO Configuration'!$B$4:$Q$97,16,FALSE)=\"下拉\",1,0)))","v":0},{"$f":"IF(ISNA(VLOOKUP($A13,'GPIO Configuration'!$B$4:$O$97,14,FALSE)),0,MATCH(VLOOKUP($A13,'GPIO Configuration'!$B$4:$O$97,14,FALSE),INDIRECT($A13&\"_Func\"),0)-1)","v":0},{"$f":"IF(ISNA(VLOOKUP($A13,'GPIO Configuration'!$B$4:$P$97,15,FALSE)),0,MATCH(VLOOKUP($A13,'GPIO Configuration'!$B$4:$P$97,15,FALSE),INDIRECT($A13&\"_OutDrv\"),0)-1)","v":0}]
["P0_11",0,11,"0x000B","GPIO_PODR0_POD11","GPIO_PIDR0_PID11",{"$f":"IF(ISNA(VLOOKUP($A14,'GPIO Configuration'!$B$4:$C$97,2,FALSE)),0,1)","v":1},{"$f":"IF(ISNA(VLOOKUP($A14,'GPIO Configuration'!$B$4:$C$97,2,FALSE)),0,IF(VLOOKUP($A14,'GPIO Configuration'!$B$4:$C$97,2,FALSE)=\"是\",1,0))","v":1},{"$f":"IF(ISNA(VLOOKUP($A14,'GPIO Configuration'!$B$4:$D$97,3,FALSE)),\"\",TRIM(VLOOKUP($A14,'GPIO Configuration'!$B$4:$D$97,3,FALSE)))","v":"Line_In_BrakeFluid"},{"$f":"IF(ISNA(VLOOKUP($A14,'GPIO Configuration'!$B$4:$E$97,4,FALSE)),0,IF(VLOOKUP($A14,'GPIO Configuration'!$B$4:$E$97,4,FALSE)=\"OUT - 输出\",1,0))","v":0},{"$f":"IF(ISNA(VLOOKUP($A14,'GPIO Configuration'!$B$4:$F$97,5,FALSE)),0,IF(VLOOKUP($A14,'GPIO Configuration'!$B$4:$F$97,5,FALSE)=\"1 - 高电平\",1,0))","v":0},{"$f":"IF(ISNA(VLOOKUP($A14,'GPIO Configuration'!$B$4:$K$97,10,FALSE)),0,IF(VLOOKUP($A14,'GPIO Configuration'!$B$4:$K$97,10,FALSE)=\"1 - 使能\",1,0))","v":1},{"$f":"IF(ISNA(VLOOKUP($A14,'GPIO Configuration'!$B$4:$J$97,9,FALSE)),0,MATCH(VLOOKUP($A14,'GPIO Configuration'!$B$4:$J$97,9,FALSE),INDIRECT($A14&\"_InLv\"),0)-1)","v":0},{"$f":"IF(ISNA(VLOOKUP($A14,'GPIO Configuration'!$B$4:$L$97,11,FALSE)),0,IF(VLOOKUP($A14,'GPIO Configuration'!$B$4:$L$97,11,FALSE)=\"1 - 使能\",1,0))","v":1},{"$f":"IF(ISNA(VLOOKUP($A14,'GPIO Configuration'!$B$4:$I$97,8,FALSE)),0,IF(VLOOKUP($A14,'GPIO Configuration'!$B$4:$I$97,8,FALSE)=\"上拉\",2,IF(VLOOKUP($A14,'GPIO Configuration'!$B$4:$I$97,8,FALSE)=\"下拉\",1,0)))","v":0},{"$f":"IF(ISNA(VLOOKUP($A14,'GPIO Configuration'!$B$4:$G$97,6,FALSE)),0,MATCH(VLOOKUP($A14,'GPIO Configuration'!$B$4:$G$97,6,FALSE),INDIRECT($A14&\"_Func\"),0)-1)","v":0},{"$f":"IF(ISNA(VLOOKUP($A14,'GPIO Configuration'!$B$4:$H$97,7,FALSE)),0,MATCH(VLOOKUP($A14,'GPIO Configuration'!$B$4:$H$97,7,FALSE),INDIRECT($A14&\"_OutDrv\"),0)-1)","v":3},{"$f":"IF(ISNA(VLOOKUP($A14,'GPIO Configuration'!$B$4:$M$97,12,FALSE)),0,IF(VLOOKUP($A14,'GPIO Configuration'!$B$4:$M$97,12,FALSE)=\"OUT - 输出\",1,0))","v":0},{"$f":"IF(ISNA(VLOOKUP($A14,'GPIO Configuration'!$B$4:$N$97,13,FALSE)),0,IF(VLOOKUP($A14,'GPIO Configuration'!$B$4:$N$97,13,FALSE)=\"1 - 高电平\",1,0))","v":0},{"$f":"IF(ISNA(VLOOKUP($A14,'GPIO Configuration'!$B$4:$S$97,18,FALSE)),0,IF(VLOOKUP($A14,'GPIO Configuration'!$B$4:$S$97,18,FALSE)=\"1 - 使能\",1,0))","v":0},{"$f":"IF(ISNA(VLOOKUP($A14,'GPIO Configuration'!$B$4:$R$97,17,FALSE)),0,MATCH(VLOOKUP($A14,'GPIO Configuration'!$B$4:$R$97,17,FALSE),INDIRECT($A14&\"_InLv\"),0)-1)","v":0},{"$f":"IF(ISNA(VLOOKUP($A14,'GPIO Configuration'!$B$4:$T$97,19,FALSE)),0,IF(VLOOKUP($A14,'GPIO Configuration'!$B$4:$T$97,19,FALSE)=\"1 - 使能\",1,0))","v":1},{"$f":"IF(ISNA(VLOOKUP($A14,'GPIO Configuration'!$B$4:$Q$97,16,FALSE)),0,IF(VLOOKUP($A14,'GPIO Configuration'!$B$4:$Q$97,16,FALSE)=\"上拉\",2,IF(VLOOKUP($A14,'GPIO Configuration'!$B$4:$Q$97,16,FALSE)=\"下拉\",1,0)))","v":0},{"$f":"IF(ISNA(VLOOKUP($A14,'GPIO Configuration'!$B$4:$O$97,14,FALSE)),0,MATCH(VLOOKUP($A14,'GPIO Configuration'!$B$4:$O$97,14,FALSE),INDIRECT($A14&\"_Func\"),0)-1)","v":0},{"$f":"IF(ISNA(VLOOKUP($A14,'GPIO Configuration'!$B$4:$P$97,15,FALSE)),0,MATCH(VLOOKUP($A14,'GPIO Configuration'!$B$4:$P$97,15,FALSE),INDIRECT($A14&\"_OutDrv\"),0)-1)","v":0}]
["P0_12",0,12,"0x000C","GPIO_PODR0_POD12","GPIO_PIDR0_PID12",{"$f":"IF(ISNA(VLOOKUP($A15,'GPIO Configuration'!$B$4:$C$97,2,FALSE)),0,1)","v":1},{"$f":"IF(ISNA(VLOOKUP($A15,'GPIO Configuration'!$B$4:$C$97,2,FALSE)),0,IF(VLOOKUP($A15,'GPIO Configuration'!$B$4:$C$97,2,FALSE)=\"是\",1,0))","v":1},{"$f":"IF(ISNA(VLOOKUP($A15,'GPIO Configuration'!$B$4:$D$97,3,FALSE)),\"\",TRIM(VLOOKUP($A15,'GPIO Configuration'!$B$4:$D$97,3,FALSE)))","v":"LightingInput_OUT"},{"$f":"IF(ISNA(VLOOKUP($A15,'GPIO Configuration'!$B$4:$E$97,4,FALSE)),0,IF(VLOOKUP($A15,'GPIO Configuration'!$B$4:$E$97,4,FALSE)=\"OUT - 输出\",1,0))","v":1},{"$f":"IF(ISNA(VLOOKUP($A15,'GPIO Configuration'!$B$4:$F$97,5,FALSE)),0,IF(VLOOKUP($A15,'GPIO Configuration'!$B$4:$F$97,5,FALSE)=\"1 - 高电平\",1,0))","v":1},{"$f":"IF(ISNA(VLOOKUP($A15,'GPIO Configuration'!$B$4:$K$97,10,FALSE)),0,IF(VLOOKUP($A15,'GPIO Configuration'!$B$4:$K$97,10,FALSE)=\"1 - 使能\",1,0))","v":0},{"$f":"IF(ISNA(VLOOKUP($A15,'GPIO Configuration'!$B$4:$J$97,9,FALSE)),0,MATCH(VLOOKUP($A15,'GPIO Configuration'!$B$4:$J$97,9,FALSE),INDIRECT($A15&\"_InLv\"),0)-1)","v":0},{"$f":"IF(ISNA(VLOOKUP($A15,'GPIO Configuration'!$B$4:$L$97,11,FALSE)),0,IF(VLOOKUP($A15,'GPIO Configuration'!$B$4:$L$97,11,FALSE)=\"1 - 使能\",1,0))","v":1},{"$f":"IF(ISNA(VLOOKUP($A15,'GPIO Configuration'!$B$4:$I$97,8,FALSE)),0,IF(VLOOKUP($A15,'GPIO Configuration'!$B$4:$I$97,8,FALSE)=\"上拉\",2,IF(VLOOKUP($A15,'GPIO Configuration'!$B$4:$I$97,8,FALSE)=\"下拉\",1,0)))","v":0},{"$f":"IF(ISNA(VLOOKUP($A15,'GPIO Configuration'!$B$4:$G$97,6,FALSE)),0,MATCH(VLOOKUP($A15,'GPIO Configuration'!$B$4:$G$97,6,FALSE),INDIRECT($A15&\"_Func\"),0)-1)","v":0},{"$f":"IF(ISNA(VLOOKUP($A15,'GPIO Configuration'!$B$4:$H$97,7,FALSE)),0,MATCH(VLOOKUP($A15,'GPIO Configuration'!$B$4:$H$97,7,FALSE),INDIRECT($A15&\"_OutDrv\"),0)-1)","v":3},{"$f":"IF(ISNA(VLOOKUP($A15,'GPIO Configuration'!$B$4:$M$97,12,FALSE)),0,IF(VLOOKUP($A15,'GPIO Configuration'!$B$4:$M$97,12,FALSE)=\"OUT - 输出\",1,0))","v":1},{"$f":"IF(ISNA(VLOOKUP($A15,'GPIO Configuration'!$B$4:$N$97,13,FALSE)),0,IF(VLOOKUP($A15,'GPIO Configuration'!$B$4:$N$97,13,FALSE)=\"1 - 高电平\",1,0))","v":0},{"$f":"IF(ISNA(VLOOKUP($A15,'GPIO Configuration'!$B$4:$S$97,18,FALSE)),0,IF(VLOOKUP($A15,'GPIO Configuration'!$B$4:$S$97,18,FALSE)=\"1 - 使能\",1,0))","v":0},{"$f":"IF(ISNA(VLOOKUP($A15,'GPIO Configuration'!$B$4:$R$97,17,FALSE)),0,MATCH(VLOOKUP($A15,'GPIO Configuration'!$B$4:$R$97,17,FALSE),INDIRECT($A15&\"_InLv\"),0)-1)","v":0},{"$f":"IF(ISNA(VLOOKUP($A15,'GPIO Configuration'!$B$4:$T$97,19,FALSE)),0,IF(VLOOKUP($A15,'GPIO Configuration'!$B$4:$T$97,19,FALSE)=\"1 - 使能\",1,0))","v":1},{"$f":"IF(ISNA(VLOOKUP($A15,'GPIO Configuration'!$B$4:$Q$97,16,FALSE)),0,IF(VLOOKUP($A15,'GPIO Configuration'!$B$4:$Q$97,16,FALSE)=\"上拉\",2,IF(VLOOKUP($A15,'GPIO Configuration'!$B$4:$Q$97,16,FALSE)=\"下拉\",1,0)))","v":0},{"$f":"IF(ISNA(VLOOKUP($A15,'GPIO Configuration'!$B$4:$O$97,14,FALSE)),0,MATCH(VLOOKUP($A15,'GPIO Configuration'!$B$4:$O$97,14,FALSE),INDIRECT($A15&\"_Func\"),0)-1)","v":0},{"$f":"IF(ISNA(VLOOKUP($A15,'GPIO Configuration'!$B$4:$P$97,15,FALSE)),0,MATCH(VLOOKUP($A15,'GPIO Configuration'!$B$4:$P$97,15,FALSE),INDIRECT($A15&\"_OutDrv\"),0)-1)","v":0}]
["P0_13",0,13,"0x000D","GPIO_PODR0_POD13","GPIO_PIDR0_PID13",{"$f":"IF(ISNA(VLOOKUP($A16,'GPIO Configuration'!$B$4:$C$97,2,FALSE)),0,1)","v":1},{"$f":"IF(ISNA(VLOOKUP($A16,'GPIO Configuration'!$B$4:$C$97,2,FALSE)),0,IF(VLOOKUP($A16,'GPIO Configuration'!$B$4:$C$97,2,FALSE)=\"是\",1,0))","v":1},{"$f":"IF(ISNA(VLOOKUP($A16,'GPIO Configuration'!$B$4:$D$97,3,FALSE)),\"\",TRIM(VLOOKUP($A16,'GPIO Configuration'!$B$4:$D$97,3,FALSE)))","v":"Line_In_OTA_Switch"},{"$f":"IF(ISNA(VLOOKUP($A16,'GPIO Configuration'!$B$4:$E$97,4,FALSE)),0,IF(VLOOKUP($A16,'GPIO Configuration'!$B$4:$E$97,4,FALSE)=\"OUT - 输出\",1,0))","v":0},{"$f":"IF(ISNA(VLOOKUP($A16,'GPIO Configuration'!$B$4:$F$97,5,FALSE)),0,IF(VLOOKUP($A16,'GPIO Configuration'!$B$4:$F$97,5,FALSE)=\"1 - 高电平\",1,0))","v":0},{"$f":"IF(ISNA(VLOOKUP($A16,'GPIO Configuration'!$B$4:$K$97,10,FALSE)),0,IF(VLOOKUP($A16,'GPIO Configuration'!$B$4:$K$97,10,FALSE)=\"1 - 使能\",1,0))","v":1},{"$f":"IF(ISNA(VLOOKUP($A16,'GPIO Configuration'!$B$4:$J$97,9,FALSE)),0,MATCH(VLOOKUP($A16,'GPIO Configuration'!$B$4:$J$97,9,FALSE),INDIRECT($A16&\"_InLv\"),0)-1)","v":0},{"$f":"IF(ISNA(VLOOKUP($A16,'GPIO Configuration'!$B$4:$L$97,11,FALSE)),0,IF(VLOOKUP($A16,'GPIO Configuration'!$B$4:$L$97,11,FALSE)=\"1 - 使能\",1,0))","v":1},{"$f":"IF(ISNA(VLOOKUP($A16,'GPIO Configuration'!$B$4:$I$97,8,FALSE)),0,IF(VLOOKUP($A16,'GPIO Configuration'!$B$4:$I$97,8,FALSE)=\"上拉\",2,IF(VLOOKUP($A16,'GPIO Configuration'!$B$4:$I$97,8,FALSE)=\"下拉\",1,0)))","v":0},{"$f":"IF(ISNA(VLOOKUP($A16,'GPIO Configuration'!$B$4:$G$97,6,FALSE)),0,MATCH(VLOOKUP($A16,'GPIO Configuration'!$B$4:$G$97,6,FALSE),INDIRECT($A16&\"_Func\"),0)-1)","v":0},{"$f":"IF(ISNA(VLOOKUP($A16,'GPIO Configuration'!$B$4:$H$97,7,FALSE)),0,MATCH(VLOOKUP($A16,'GPIO Configuration'!$B$4:$H$97,7,FALSE),INDIRECT($A16&\"_OutDrv\"),0)-1)","v":2},{"$f":"IF(ISNA(VLOOKUP($A16,'GPIO Configuration'!$B$4:$M$97,12,FALSE)),0,IF(VLOOKUP($A16,'GPIO Configuration'!$B$4:$M$97,12,FALSE)=\"OUT - 输出\",1,0))","v":0},{"$f":"IF(ISNA(VLOOKUP($A16,'GPIO Configuration'!$B$4:$N$97,13,FALSE)),0,IF(VLOOKUP($A16,'GPIO Configuration'!$B$4:$N$97,13,FALSE)=\"1 - 高电平\",1,0))","v":0},{"$f":"IF(ISNA(VLOOKUP($A16,'GPIO Configuration'!$B$4:$S$97,18,FALSE)),0,IF(VLOOKUP($A16,'GPIO Configuration'!$B$4:$S$97,18,FALSE)=\"1 - 使能\",1,0))","v":0},{"$f":"IF(ISNA(VLOOKUP($A16,'GPIO Configuration'!$B$4:$R$97,17,FALSE)),0,MATCH(VLOOKUP($A16,'GPIO Configuration'!$B$4:$R$97,17,FALSE),INDIRECT($A16&\"_InLv\"),0)-1)","v":0},{"$f":"IF(ISNA(VLOOKUP($A16,'GPIO Configuration'!$B$4:$T$97,19,FALSE)),0,IF(VLOOKUP($A16,'GPIO Configuration'!$B$4:$T$97,19,FALSE)=\"1 - 使能\",1,0))","v":1},{"$f":"IF(ISNA(VLOOKUP($A16,'GPIO Configuration'!$B$4:$Q$97,16,FALSE)),0,IF(VLOOKUP($A16,'GPIO Configuration'!$B$4:$Q$97,16,FALSE)=\"上拉\",2,IF(VLOOKUP($A16,'GPIO Configuration'!$B$4:$Q$97,16,FALSE)=\"下拉\",1,0)))","v":0},{"$f":"IF(ISNA(VLOOKUP($A16,'GPIO Configuration'!$B$4:$O$97,14,FALSE)),0,MATCH(VLOOKUP($A16,'GPIO Configuration'!$B$4:$O$97,14,FALSE),INDIRECT($A16&\"_Func\"),0)-1)","v":0},{"$f":"IF(ISNA(VLOOKUP($A16,'GPIO Configuration'!$B$4:$P$97,15,FALSE)),0,MATCH(VLOOKUP($A16,'GPIO Configuration'!$B$4:$P$97,15,FALSE),INDIRECT($A16&\"_OutDrv\"),0)-1)","v":0}]
["P0_14",0,14,"0x000E","GPIO_PODR0_POD14","GPIO_PIDR0_PID14",{"$f":"IF(ISNA(VLOOKUP($A17,'GPIO Configuration'!$B$4:$C$97,2,FALSE)),0,1)","v":1},{"$f":"IF(ISNA(VLOOKUP($A17,'GPIO Configuration'!$B$4:$C$97,2,FALSE)),0,IF(VLOOKUP($A17,'GPIO Configuration'!$B$4:$C$97,2,FALSE)=\"是\",1,0))","v":1},{"$f":"IF(ISNA(VLOOKUP($A17,'GPIO Configuration'!$B$4:$D$97,3,FALSE)),\"\",TRIM(VLOOKUP($A17,'GPIO Configuration'!$B$4:$D$97,3,FALSE)))","v":"Line_In_TRIP_Switch"},{"$f":"IF(ISNA(VLOOKUP($A17,'GPIO Configuration'!$B$4:$E$97,4,FALSE)),0,IF(VLOOKUP($A17,'GPIO Configuration'!$B$4:$E$97,4,FALSE)=\"OUT - 输出\",1,0))","v":0},{"$f":"IF(ISNA(VLOOKUP($A17,'GPIO Configuration'!$B$4:$F$97,5,FALSE)),0,IF(VLOOKUP($A17,'GPIO Configuration'!$B$4:$F$97,5,FALSE)=\"1 - 高电平\",1,0))","v":0},{"$f":"IF(ISNA(VLOOKUP($A17,'GPIO Configuration'!$B$4:$K$97,10,FALSE)),0,IF(VLOOKUP($A17,'GPIO Configuration'!$B$4:$K$97,10,FALSE)=\"1 - 使能\",1,0))","v":1},{"$f":"IF(ISNA(VLOOKUP($A17,'GPIO Configuration'!$B$4:$J$97,9,FALSE)),0,MATCH(VLOOKUP($A17,'GPIO Configuration'!$B$4:$J$97,9,FALSE),INDIRECT($A17&\"_InLv\"),0)-1)","v":0},{"$f":"IF(ISNA(VLOOKUP($A17,'GPIO Configuration'!$B$4:$L$97,11,FALSE)),0,IF(VLOOKUP($A17,'GPIO Configuration'!$B$4:$L$97,11,FALSE)=\"1 - 使能\",1,0))","v":1},{"$f":"IF(ISNA(VLOOKUP($A17,'GPIO Configuration'!$B$4:$I$97,8,FALSE)),0,IF(VLOOKUP($A17,'GPIO Configuration'!$B$4:$I$97,8,FALSE)=\"上拉\",2,IF(VLOOKUP($A17,'GPIO Configuration'!$B$4:$I$97,8,FALSE)=\"下拉\",1,0)))","v":0},{"$f":"IF(ISNA(VLOOKUP($A17,'GPIO Configuration'!$B$4:$G$97,6,FALSE)),0,MATCH(VLOOKUP($A17,'GPIO Configuration'!$B$4:$G$97,6,FALSE),INDIRECT($A17&\"_Func\"),0)-1)","v":0},{"$f":"IF(ISNA(VLOOKUP($A17,'GPIO Configuration'!$B$4:$H$97,7,FALSE)),0,MATCH(VLOOKUP($A17,'GPIO Configuration'!$B$4:$H$97,7,FALSE),INDIRECT($A17&\"_OutDrv\"),0)-1)","v":2},{"$f":"IF(ISNA(VLOOKUP($A17,'GPIO Configuration'!$B$4:$M$97,12,FALSE)),0,IF(VLOOKUP($A17,'GPIO Configuration'!$B$4:$M$97,12,FALSE)=\"OUT - 输出\",1,0))","v":0},{"$f":"IF(ISNA(VLOOKUP($A17,'GPIO Configuration'!$B$4:$N$97,13,FALSE)),0,IF(VLOOKUP($A17,'GPIO Configuration'!$B$4:$N$97,13,FALSE)=\"1 - 高电平\",1,0))","v":0},{"$f":"IF(ISNA(VLOOKUP($A17,'GPIO Configuration'!$B$4:$S$97,18,FALSE)),0,IF(VLOOKUP($A17,'GPIO Configuration'!$B$4:$S$97,18,FALSE)=\"1 - 使能\",1,0))","v":0},{"$f":"IF(ISNA(VLOOKUP($A17,'GPIO Configuration'!$B$4:$R$97,17,FALSE)),0,MATCH(VLOOKUP($A17,'GPIO Configuration'!$B$4:$R$97,17,FALSE),INDIRECT($A17&\"_InLv\"),0)-1)","v":0},{"$f":"IF(ISNA(VLOOKUP($A17,'GPIO Configuration'!$B$4:$T$97,19,FALSE)),0,IF(VLOOKUP($A17,'GPIO Configuration'!$B$4:$T$97,19,FALSE)=\"1 - 使能\",1,0))","v":1},{"$f":"IF(ISNA(VLOOKUP($A17,'GPIO Configuration'!$B$4:$Q$97,16,FALSE)),0,IF(VLOOKUP($A17,'GPIO Configuration'!$B$4:$Q$97,16,FALSE)=\"上拉\",2,IF(VLOOKUP($A17,'GPIO Configuration'!$B$4:$Q$97,16,FALSE)=\"下拉\",1,0)))","v":0},{"$f":"IF(ISNA(VLOOKUP($A17,'GPIO Configuration'!$B$4:$O$97,14,FALSE)),0,MATCH(VLOOKUP($A17,'GPIO Configuration'!$B$4:$O$97,14,FALSE),INDIRECT($A17&\"_Func\"),0)-1)","v":0},{"$f":"IF(ISNA(VLOOKUP($A17,'GPIO Configuration'!$B$4:$P$97,15,FALSE)),0,MATCH(VLOOKUP($A17,'GPIO Configuration'!$B$4:$P$97,15,FALSE),INDIRECT($A17&\"_OutDrv\"),0)-1)","v":0}]
["P0_15",0,15,"0x000F","GPIO_PODR0_POD15","GPIO_PIDR0_PID15",{"$f":"IF(ISNA(VLOOKUP($A18,'GPIO Configuration'!$B$4:$C$97,2,FALSE)),0,1)","v":1},{"$f":"IF(ISNA(VLOOKUP($A18,'GPIO Configuration'!$B$4:$C$97,2,FALSE)),0,IF(VLOOKUP($A18,'GPIO Configuration'!$B$4:$C$97,2,FALSE)=\"是\",1,0))","v":1},{"$f":"IF(ISNA(VLOOKUP($A18,'GPIO Configuration'!$B$4:$D$97,3,FALSE)),\"\",TRIM(VLOOKUP($A18,'GPIO Configuration'!$B$4:$D$97,3,FALSE)))","v":"Line_In_SEATBELT_DR"},{"$f":"IF(ISNA(VLOOKUP($A18,'GPIO Configuration'!$B$4:$E$97,4,FALSE)),0,IF(VLOOKUP($A18,'GPIO Configuration'!$B$4:$E$97,4,FALSE)=\"OUT - 输出\",1,0))","v":0},{"$f":"IF(ISNA(VLOOKUP($A18,'GPIO Configuration'!$B$4:$F$97,5,FALSE)),0,IF(VLOOKUP($A18,'GPIO Configuration'!$B$4:$F$97,5,FALSE)=\"1 - 高电平\",1,0))","v":0},{"$f":"IF(ISNA(VLOOKUP($A18,'GPIO Configuration'!$B$4:$K$97,10,FALSE)),0,IF(VLOOKUP($A18,'GPIO Configuration'!$B$4:$K$97,10,FALSE)=\"1 - 使能\",1,0))","v":1},{"$f":"IF(ISNA(VLOOKUP($A18,'GPIO Configuration'!$B$4:$J$97,9,FALSE)),0,MATCH(VLOOKUP($A18,'GPIO Configuration'!$B$4:$J$97,9,FALSE),INDIRECT($A18&\"_InLv\"),0)-1)","v":0},{"$f":"IF(ISNA(VLOOKUP($A18,'GPIO Configuration'!$B$4:$L$97,11,FALSE)),0,IF(VLOOKUP($A18,'GPIO Configuration'!$B$4:$L$97,11,FALSE)=\"1 - 使能\",1,0))","v":1},{"$f":"IF(ISNA(VLOOKUP($A18,'GPIO Configuration'!$B$4:$I$97,8,FALSE)),0,IF(VLOOKUP($A18,'GPIO Configuration'!$B$4:$I$97,8,FALSE)=\"上拉\",2,IF(VLOOKUP($A18,'GPIO Configuration'!$B$4:$I$97,8,FALSE)=\"下拉\",1,0)))","v":0},{"$f":"IF(ISNA(VLOOKUP($A18,'GPIO Configuration'!$B$4:$G$97,6,FALSE)),0,MATCH(VLOOKUP($A18,'GPIO Configuration'!$B$4:$G$97,6,FALSE),INDIRECT($A18&\"_Func\"),0)-1)","v":0},{"$f":"IF(ISNA(VLOOKUP($A18,'GPIO Configuration'!$B$4:$H$97,7,FALSE)),0,MATCH(VLOOKUP($A18,'GPIO Configuration'!$B$4:$H$97,7,FALSE),INDIRECT($A18&\"_OutDrv\"),0)-1)","v":2},{"$f":"IF(ISNA(VLOOKUP($A18,'GPIO Configuration'!$B$4:$M$97,12,FALSE)),0,IF(VLOOKUP($A18,'GPIO Configuration'!$B$4:$M$97,12,FALSE)=\"OUT - 输出\",1,0))","v":0},{"$f":"IF(ISNA(VLOOKUP($A18,'GPIO Configuration'!$B$4:$N$97,13,FALSE)),0,IF(VLOOKUP($A18,'GPIO Configuration'!$B$4:$N$97,13,FALSE)=\"1 - 高电平\",1,0))","v":0},{"$f":"IF(ISNA(VLOOKUP($A18,'GPIO Configuration'!$B$4:$S$97,18,FALSE)),0,IF(VLOOKUP($A18,'GPIO Configuration'!$B$4:$S$97,18,FALSE)=\"1 - 使能\",1,0))","v":0},{"$f":"IF(ISNA(VLOOKUP($A18,'GPIO Configuration'!$B$4:$R$97,17,FALSE)),0,MATCH(VLOOKUP($A18,'GPIO Configuration'!$B$4:$R$97,17,FALSE),INDIRECT($A18&\"_InLv\"),0)-1)","v":0},{"$f":"IF(ISNA(VLOOKUP($A18,'GPIO Configuration'!$B$4:$T$97,19,FALSE)),0,IF(VLOOKUP($A18,'GPIO Configuration'!$B$4:$T$97,19,FALSE)=\"1 - 使能\",1,0))","v":1},{"$f":"IF(ISNA(VLOOKUP($A18,'GPIO Configuration'!$B$4:$Q$97,16,FALSE)),0,IF(VLOOKUP($A18,'GPIO Configuration'!$B$4:$Q$97,16,FALSE)=\"上拉\",2,IF(VLOOKUP($A18,'GPIO Configuration'!$B$4:$Q$97,16,FALSE)=\"下拉\",1,0)))","v":0},{"$f":"IF(ISNA(VLOOKUP($A18,'GPIO Configuration'!$B$4:$O$97,14,FALSE)),0,MATCH(VLOOKUP($A18,'GPIO Configuration'!$B$4:$O$97,14,FALSE),INDIRECT($A18&\"_Func\"),0)-1)","v":0},{"$f":"IF(ISNA(VLOOKUP($A18,'GPIO Configuration'!$B$4:$P$97,15,FALSE)),0,MATCH(VLOOKUP($A18,'GPIO Configuration'!$B$4:$P$97,15,FALSE),INDIRECT($A18&\"_OutDrv\"),0)-1)","v":0}]
["P0_16",0,16,"0x0010","GPIO_PODR0_POD16","GPIO_PIDR0_PID16",{"$f":"IF(ISNA(VLOOKUP($A19,'GPIO Configuration'!$B$4:$C$97,2,FALSE)),0,1)","v":1},{"$f":"IF(ISNA(VLOOKUP($A19,'GPIO Configuration'!$B$4:$C$97,2,FALSE)),0,IF(VLOOKUP($A19,'GPIO Configuration'!$B$4:$C$97,2,FALSE)=\"是\",1,0))","v":0},{"$f":"IF(ISNA(VLOOKUP($A19,'GPIO Configuration'!$B$4:$D$97,3,FALSE)),\"\",TRIM(VLOOKUP($A19,'GPIO Configuration'!$B$4:$D$97,3,FALSE)))","v":""},{"$f":"IF(ISNA(VLOOKUP($A19,'GPIO Configuration'!$B$4:$E$97,4,FALSE)),0,IF(VLOOKUP($A19,'GPIO Configuration'!$B$4:$E$97,4,FALSE)=\"OUT - 输出\",1,0))","v":1},{"$f":"IF(ISNA(VLOOKUP($A19,'GPIO Configuration'!$B$4:$F$97,5,FALSE)),0,IF(VLOOKUP($A19,'GPIO Configuration'!$B$4:$F$97,5,FALSE)=\"1 - 高电平\",1,0))","v":0},{"$f":"IF(ISNA(VLOOKUP($A19,'GPIO Configuration'!$B$4:$K$97,10,FALSE)),0,IF(VLOOKUP($A19,'GPIO Configuration'!$B$4:$K$97,10,FALSE)=\"1 - 使能\",1,0))","v":0},{"$f":"IF(ISNA(VLOOKUP($A19,'GPIO Configuration'!$B$4:$J$97,9,FALSE)),0,MATCH(VLOOKUP($A19,'GPIO Configuration'!$B$4:$J$97,9,FALSE),INDIRECT($A19&\"_InLv\"),0)-1)","v":0},{"$f":"IF(ISNA(VLOOKUP($A19,'GPIO Configuration'!$B$4:$L$97,11,FALSE)),0,IF(VLOOKUP($A19,'GPIO Configuration'!$B$4:$L$97,11,FALSE)=\"1 - 使能\",1,0))","v":1},{"$f":"IF(ISNA(VLOOKUP($A19,'GPIO Configuration'!$B$4:$I$97,8,FALSE)),0,IF(VLOOKUP($A19,'GPIO Configuration'!$B$4:$I$97,8,FALSE)=\"上拉\",2,IF(VLOOKUP($A19,'GPIO Configuration'!$B$4:$I$97,8,FALSE)=\"下拉\",1,0)))","v":0},{"$f":"IF(ISNA(VLOOKUP($A19,'GPIO Configuration'!$B$4:$G$97,6,FALSE)),0,MATCH(VLOOKUP($A19,'GPIO Configuration'!$B$4:$G$97,6,FALSE),INDIRECT($A19&\"_Func\"),0)-1)","v":0},{"$f":"IF(ISNA(VLOOKUP($A19,'GPIO Configuration'!$B$4:$H$97,7,FALSE)),0,MATCH(VLOOKUP($A19,'GPIO Configuration'!$B$4:$H$97,7,FALSE),INDIRECT($A19&\"_OutDrv\"),0)-1)","v":3},{"$f":"IF(ISNA(VLOOKUP($A19,'GPIO Configuration'!$B$4:$M$97,12,FALSE)),0,IF(VLOOKUP($A19,'GPIO Configuration'!$B$4:$M$97,12,FALSE)=\"OUT - 输出\",1,0))","v":1},{"$f":"IF(ISNA(VLOOKUP($A19,'GPIO Configuration'!$B$4:$N$97,13,FALSE)),0,IF(VLOOKUP($A19,'GPIO Configuration'!$B$4:$N$97,13,FALSE)=\"1 - 高电平\",1,0))","v":0},{"$f":"IF(ISNA(VLOOKUP($A19,'GPIO Configuration'!$B$4:$S$97,18,FALSE)),0,IF(VLOOKUP($A19,'GPIO Configuration'!$B$4:$S$97,18,FALSE)=\"1 - 使能\",1,0))","v":0},{"$f":"IF(ISNA(VLOOKUP($A19,'GPIO Configuration'!$B$4:$R$97,17,FALSE)),0,MATCH(VLOOKUP($A19,'GPIO Configuration'!$B$4:$R$97,17,FALSE),INDIRECT($A19&\"_InLv\"),0)-1)","v":0},{"$f":"IF(ISNA(VLOOKUP($A19,'GPIO Configuration'!$B$4:$T$97,19,FALSE)),0,IF(VLOOKUP($A19,'GPIO Configuration'!$B$4:$T$97,19,FALSE)=\"1 - 使能\",1,0))","v":1},{"$f":"IF(ISNA(VLOOKUP($A19,'GPIO Configuration'!$B$4:$Q$97,16,FALSE)),0,IF(VLOOKUP($A19,'GPIO Configuration'!$B$4:$Q$97,16,FALSE)=\"上拉\",2,IF(VLOOKUP($A19,'GPIO Configuration'!$B$4:$Q$97,16,FALSE)=\"下拉\",1,0)))","v":0},{"$f":"IF(ISNA(VLOOKUP($A19,'GPIO Configuration'!$B$4:$O$97,14,FALSE)),0,MATCH(VLOOKUP($A19,'GPIO Configuration'!$B$4:$O$97,14,FALSE),INDIRECT($A19&\"_Func\"),0)-1)","v":0},{"$f":"IF(ISNA(VLOOKUP($A19,'GPIO Configuration'!$B$4:$P$97,15,FALSE)),0,MATCH(VLOOKUP($A19,'GPIO Configuration'!$B$4:$P$97,15,FALSE),INDIRECT($A19&\"_OutDrv\"),0)-1)","v":0}]
["P0_17",0,17,"0x0011","GPIO_PODR0_POD17","GPIO_PIDR0_PID17",{"$f":"IF(ISNA(VLOOKUP($A20,'GPIO Configuration'!$B$4:$C$97,2,FALSE)),0,1)","v":1},{"$f":"IF(ISNA(VLOOKUP($A20,'GPIO Configuration'!$B$4:$C$97,2,FALSE)),0,IF(VLOOKUP($A20,'GPIO Configuration'!$B$4:$C$97,2,FALSE)=\"是\",1,0))","v":0},{"$f":"IF(ISNA(VLOOKUP($A20,'GPIO Configuration'!$B$4:$D$97,3,FALSE)),\"\",TRIM(VLOOKUP($A20,'GPIO Configuration'!$B$4:$D$97,3,FALSE)))","v":""},{"$f":"IF(ISNA(VLOOKUP($A20,'GPIO Configuration'!$B$4:$E$97,4,FALSE)),0,IF(VLOOKUP($A20,'GPIO Configuration'!$B$4:$E$97,4,FALSE)=\"OUT - 输出\",1,0))","v":1},{"$f":"IF(ISNA(VLOOKUP($A20,'GPIO Configuration'!$B$4:$F$97,5,FALSE)),0,IF(VLOOKUP($A20,'GPIO Configuration'!$B$4:$F$97,5,FALSE)=\"1 - 高电平\",1,0))","v":0},{"$f":"IF(ISNA(VLOOKUP($A20,'GPIO Configuration'!$B$4:$K$97,10,FALSE)),0,IF(VLOOKUP($A20,'GPIO Configuration'!$B$4:$K$97,10,FALSE)=\"1 - 使能\",1,0))","v":0},{"$f":"IF(ISNA(VLOOKUP($A20,'GPIO Configuration'!$B$4:$J$97,9,FALSE)),0,MATCH(VLOOKUP($A20,'GPIO Configuration'!$B$4:$J$97,9,FALSE),INDIRECT($A20&\"_InLv\"),0)-1)","v":0},{"$f":"IF(ISNA(VLOOKUP($A20,'GPIO Configuration'!$B$4:$L$97,11,FALSE)),0,IF(VLOOKUP($A20,'GPIO Configuration'!$B$4:$L$97,11,FALSE)=\"1 - 使能\",1,0))","v":1},{"$f":"IF(ISNA(VLOOKUP($A20,'GPIO Configuration'!$B$4:$I$97,8,FALSE)),0,IF(VLOOKUP($A20,'GPIO Configuration'!$B$4:$I$97,8,FALSE)=\"上拉\",2,IF(VLOOKUP($A20,'GPIO Configuration'!$B$4:$I$97,8,FALSE)=\"下拉\",1,0)))","v":0},{"$f":"IF(ISNA(VLOOKUP($A20,'GPIO Configuration'!$B$4:$G$97,6,FALSE)),0,MATCH(VLOOKUP($A20,'GPIO Configuration'!$B$4:$G$97,6,FALSE),INDIRECT($A20&\"_Func\"),0)-1)","v":0},{"$f":"IF(ISNA(VLOOKUP($A20,'GPIO Configuration'!$B$4:$H$97,7,FALSE)),0,MATCH(VLOOKUP($A20,'GPIO Configuration'!$B$4:$H$97,7,FALSE),INDIRECT($A20&\"_OutDrv\"),0)-1)","v":3},{"$f":"IF(ISNA(VLOOKUP($A20,'GPIO Configuration'!$B$4:$M$97,12,FALSE)),0,IF(VLOOKUP($A20,'GPIO Configuration'!$B$4:$M$97,12,FALSE)=\"OUT - 输出\",1,0))","v":1},{"$f":"IF(ISNA(VLOOKUP($A20,'GPIO Configuration'!$B$4:$N$97,13,FALSE)),0,IF(VLOOKUP($A20,'GPIO Configuration'!$B$4:$N$97,13,FALSE)=\"1 - 高电平\",1,0))","v":0},{"$f":"IF(ISNA(VLOOKUP($A20,'GPIO Configuration'!$B$4:$S$97,18,FALSE)),0,IF(VLOOKUP($A20,'GPIO Configuration'!$B$4:$S$97,18,FALSE)=\"1 - 使能\",1,0))","v":0},{"$f":"IF(ISNA(VLOOKUP($A20,'GPIO Configuration'!$B$4:$R$97,17,FALSE)),0,MATCH(VLOOKUP($A20,'GPIO Configuration'!$B$4:$R$97,17,FALSE),INDIRECT($A20&\"_InLv\"),0)-1)","v":0},{"$f":"IF(ISNA(VLOOKUP($A20,'GPIO Configuration'!$B$4:$T$97,19,FALSE)),0,IF(VLOOKUP($A20,'GPIO Configuration'!$B$4:$T$97,19,FALSE)=\"1 - 使能\",1,0))","v":1},{"$f":"IF(ISNA(VLOOKUP($A20,'GPIO Configuration'!$B$4:$Q$97,16,FALSE)),0,IF(VLOOKUP($A20,'GPIO Configuration'!$B$4:$Q$97,16,FALSE)=\"上拉\",2,IF(VLOOKUP($A20,'GPIO Configuration'!$B$4:$Q$97,16,FALSE)=\"下拉\",1,0)))","v":0},{"$f":"IF(ISNA(VLOOKUP($A20,'GPIO Configuration'!$B$4:$O$97,14,FALSE)),0,MATCH(VLOOKUP($A20,'GPIO Configuration'!$B$4:$O$97,14,FALSE),INDIRECT($A20&\"_Func\"),0)-1)","v":0},{"$f":"IF(ISNA(VLOOKUP($A20,'GPIO Configuration'!$B$4:$P$97,15,FALSE)),0,MATCH(VLOOKUP($A20,'GPIO Configuration'!$B$4:$P$97,15,FALSE),INDIRECT($A20&\"_OutDrv\"),0)-1)","v":0}]
["P0_18",0,18,"0x0012","GPIO_PODR0_POD18","GPIO_PIDR0_PID18",{"$f":"IF(ISNA(VLOOKUP($A21,'GPIO Configuration'!$B$4:$C$97,2,FALSE)),0,1)","v":1},{"$f":"IF(ISNA(VLOOKUP($A21,'GPIO Configuration'!$B$4:$C$97,2,FALSE)),0,IF(VLOOKUP($A21,'GPIO Configuration'!$B$4:$C$97,2,FALSE)=\"是\",1,0))","v":1},{"$f":"IF(ISNA(VLOOKUP($A21,'GPIO Configuration'!$B$4:$D$97,3,FALSE)),\"\",TRIM(VLOOKUP($A21,'GPIO Configuration'!$B$4:$D$97,3,FALSE)))","v":"Line_In_TurnRight"},{"$f":"IF(ISNA(VLOOKUP($A21,'GPIO Configuration'!$B$4:$E$97,4,FALSE)),0,IF(VLOOKUP($A21,'GPIO Configuration'!$B$4:$E$97,4,FALSE)=\"OUT - 输出\",1,0))","v":0},{"$f":"IF(ISNA(VLOOKUP($A21,'GPIO Configuration'!$B$4:$F$97,5,FALSE)),0,IF(VLOOKUP($A21,'GPIO Configuration'!$B$4:$F$97,5,FALSE)=\"1 - 高电平\",1,0))","v":0},{"$f":"IF(ISNA(VLOOKUP($A21,'GPIO Configuration'!$B$4:$K$97,10,FALSE)),0,IF(VLOOKUP($A21,'GPIO Configuration'!$B$4:$K$97,10,FALSE)=\"1 - 使能\",1,0))","v":1},{"$f":"IF(ISNA(VLOOKUP($A21,'GPIO Configuration'!$B$4:$J$97,9,FALSE)),0,MATCH(VLOOKUP($A21,'GPIO Configuration'!$B$4:$J$97,9,FALSE),INDIRECT($A21&\"_InLv\"),0)-1)","v":0},{"$f":"IF(ISNA(VLOOKUP($A21,'GPIO Configuration'!$B$4:$L$97,11,FALSE)),0,IF(VLOOKUP($A21,'GPIO Configuration'!$B$4:$L$97,11,FALSE)=\"1 - 使能\",1,0))","v":1},{"$f":"IF(ISNA(VLOOKUP($A21,'GPIO Configuration'!$B$4:$I$97,8,FALSE)),0,IF(VLOOKUP($A21,'GPIO Configuration'!$B$4:$I$97,8,FALSE)=\"上拉\",2,IF(VLOOKUP($A21,'GPIO Configuration'!$B$4:$I$97,8,FALSE)=\"下拉\",1,0)))","v":0},{"$f":"IF(ISNA(VLOOKUP($A21,'GPIO Configuration'!$B$4:$G$97,6,FALSE)),0,MATCH(VLOOKUP($A21,'GPIO Configuration'!$B$4:$G$97,6,FALSE),INDIRECT($A21&\"_Func\"),0)-1)","v":0},{"$f":"IF(ISNA(VLOOKUP($A21,'GPIO Configuration'!$B$4:$H$97,7,FALSE)),0,MATCH(VLOOKUP($A21,'GPIO Configuration'!$B$4:$H$97,7,FALSE),INDIRECT($A21&\"_OutDrv\"),0)-1)","v":2},{"$f":"IF(ISNA(VLOOKUP($A21,'GPIO Configuration'!$B$4:$M$97,12,FALSE)),0,IF(VLOOKUP($A21,'GPIO Configuration'!$B$4:$M$97,12,FALSE)=\"OUT - 输出\",1,0))","v":0},{"$f":"IF(ISNA(VLOOKUP($A21,'GPIO Configuration'!$B$4:$N$97,13,FALSE)),0,IF(VLOOKUP($A21,'GPIO Configuration'!$B$4:$N$97,13,FALSE)=\"1 - 高电平\",1,0))","v":0},{"$f":"IF(ISNA(VLOOKUP($A21,'GPIO Configuration'!$B$4:$S$97,18,FALSE)),0,IF(VLOOKUP($A21,'GPIO Configuration'!$B$4:$S$97,18,FALSE)=\"1 - 使能\",1,0))","v":1},{"$f":"IF(ISNA(VLOOKUP($A21,'GPIO Configuration'!$B$4:$R$97,17,FALSE)),0,MATCH(VLOOKUP($A21,'GPIO Configuration'!$B$4:$R$97,17,FALSE),INDIRECT($A21&\"_InLv\"),0)-1)","v":0},{"$f":"IF(ISNA(VLOOKUP($A21,'GPIO Configuration'!$B$4:$T$97,19,FALSE)),0,IF(VLOOKUP($A21,'GPIO Configuration'!$B$4:$T$97,19,FALSE)=\"1 - 使能\",1,0))","v":1},{"$f":"IF(ISNA(VLOOKUP($A21,'GPIO Configuration'!$B$4:$Q$97,16,FALSE)),0,IF(VLOOKUP($A21,'GPIO Configuration'!$B$4:$Q$97,16,FALSE)=\"上拉\",2,IF(VLOOKUP($A21,'GPIO Configuration'!$B$4:$Q$97,16,FALSE)=\"下拉\",1,0)))","v":0},{"$f":"IF(ISNA(VLOOKUP($A21,'GPIO Configuration'!$B$4:$O$97,14,FALSE)),0,MATCH(VLOOKUP($A21,'GPIO Configuration'!$B$4:$O$97,14,FALSE),INDIRECT($A21&\"_Func\"),0)-1)","v":0},{"$f":"IF(ISNA(VLOOKUP($A21,'GPIO Configuration'!$B$4:$P$97,15,FALSE)),0,MATCH(VLOOKUP($A21,'GPIO Configuration'!$B$4:$P$97,15,FALSE),INDIRECT($A21&\"_OutDrv\"),0)-1)","v":0}]
["P0_19",0,19,"0x0013","GPIO_PODR0_POD19","GPIO_PIDR0_PID19",{"$f":"IF(ISNA(VLOOKUP($A22,'GPIO Configuration'!$B$4:$C$97,2,FALSE)),0,1)","v":1},{"$f":"IF(ISNA(VLOOKUP($A22,'GPIO Configuration'!$B$4:$C$97,2,FALSE)),0,IF(VLOOKUP($A22,'GPIO Configuration'!$B$4:$C$97,2,FALSE)=\"是\",1,0))","v":1},{"$f":"IF(ISNA(VLOOKUP($A22,'GPIO Configuration'!$B$4:$D$97,3,FALSE)),\"\",TRIM(VLOOKUP($A22,'GPIO Configuration'!$B$4:$D$97,3,FALSE)))","v":"Line_In_Hbeam"},{"$f":"IF(ISNA(VLOOKUP($A22,'GPIO Configuration'!$B$4:$E$97,4,FALSE)),0,IF(VLOOKUP($A22,'GPIO Configuration'!$B$4:$E$97,4,FALSE)=\"OUT - 输出\",1,0))","v":0},{"$f":"IF(ISNA(VLOOKUP($A22,'GPIO Configuration'!$B$4:$F$97,5,FALSE)),0,IF(VLOOKUP($A22,'GPIO Configuration'!$B$4:$F$97,5,FALSE)=\"1 - 高电平\",1,0))","v":0},{"$f":"IF(ISNA(VLOOKUP($A22,'GPIO Configuration'!$B$4:$K$97,10,FALSE)),0,IF(VLOOKUP($A22,'GPIO Configuration'!$B$4:$K$97,10,FALSE)=\"1 - 使能\",1,0))","v":1},{"$f":"IF(ISNA(VLOOKUP($A22,'GPIO Configuration'!$B$4:$J$97,9,FALSE)),0,MATCH(VLOOKUP($A22,'GPIO Configuration'!$B$4:$J$97,9,FALSE),INDIRECT($A22&\"_InLv\"),0)-1)","v":0},{"$f":"IF(ISNA(VLOOKUP($A22,'GPIO Configuration'!$B$4:$L$97,11,FALSE)),0,IF(VLOOKUP($A22,'GPIO Configuration'!$B$4:$L$97,11,FALSE)=\"1 - 使能\",1,0))","v":1},{"$f":"IF(ISNA(VLOOKUP($A22,'GPIO Configuration'!$B$4:$I$97,8,FALSE)),0,IF(VLOOKUP($A22,'GPIO Configuration'!$B$4:$I$97,8,FALSE)=\"上拉\",2,IF(VLOOKUP($A22,'GPIO Configuration'!$B$4:$I$97,8,FALSE)=\"下拉\",1,0)))","v":0},{"$f":"IF(ISNA(VLOOKUP($A22,'GPIO Configuration'!$B$4:$G$97,6,FALSE)),0,MATCH(VLOOKUP($A22,'GPIO Configuration'!$B$4:$G$97,6,FALSE),INDIRECT($A22&\"_Func\"),0)-1)","v":0},{"$f":"IF(ISNA(VLOOKUP($A22,'GPIO Configuration'!$B$4:$H$97,7,FALSE)),0,MATCH(VLOOKUP($A22,'GPIO Configuration'!$B$4:$H$97,7,FALSE),INDIRECT($A22&\"_OutDrv\"),0)-1)","v":2},{"$f":"IF(ISNA(VLOOKUP($A22,'GPIO Configuration'!$B$4:$M$97,12,FALSE)),0,IF(VLOOKUP($A22,'GPIO Configuration'!$B$4:$M$97,12,FALSE)=\"OUT - 输出\",1,0))","v":0},{"$f":"IF(ISNA(VLOOKUP($A22,'GPIO Configuration'!$B$4:$N$97,13,FALSE)),0,IF(VLOOKUP($A22,'GPIO Configuration'!$B$4:$N$97,13,FALSE)=\"1 - 高电平\",1,0))","v":0},{"$f":"IF(ISNA(VLOOKUP($A22,'GPIO Configuration'!$B$4:$S$97,18,FALSE)),0,IF(VLOOKUP($A22,'GPIO Configuration'!$B$4:$S$97,18,FALSE)=\"1 - 使能\",1,0))","v":0},{"$f":"IF(ISNA(VLOOKUP($A22,'GPIO Configuration'!$B$4:$R$97,17,FALSE)),0,MATCH(VLOOKUP($A22,'GPIO Configuration'!$B$4:$R$97,17,FALSE),INDIRECT($A22&\"_InLv\"),0)-1)","v":0},{"$f":"IF(ISNA(VLOOKUP($A22,'GPIO Configuration'!$B$4:$T$97,19,FALSE)),0,IF(VLOOKUP($A22,'GPIO Configuration'!$B$4:$T$97,19,FALSE)=\"1 - 使能\",1,0))","v":1},{"$f":"IF(ISNA(VLOOKUP($A22,'GPIO Configuration'!$B$4:$Q$97,16,FALSE)),0,IF(VLOOKUP($A22,'GPIO Configuration'!$B$4:$Q$97,16,FALSE)=\"上拉\",2,IF(VLOOKUP($A22,'GPIO Configuration'!$B$4:$Q$97,16,FALSE)=\"下拉\",1,0)))","v":0},{"$f":"IF(ISNA(VLOOKUP($A22,'GPIO Configuration'!$B$4:$O$97,14,FALSE)),0,MATCH(VLOOKUP($A22,'GPIO Configuration'!$B$4:$O$97,14,FALSE),INDIRECT($A22&\"_Func\"),0)-1)","v":0},{"$f":"IF(ISNA(VLOOKUP($A22,'GPIO Configuration'!$B$4:$P$97,15,FALSE)),0,MATCH(VLOOKUP($A22,'GPIO Configuration'!$B$4:$P$97,15,FALSE),INDIRECT($A22&\"_OutDrv\"),0)-1)","v":0}]
["P0_20",0,20,"0x0014","GPIO_PODR0_POD20","GPIO_PIDR0_PID20",{"$f":"IF(ISNA(VLOOKUP($A23,'GPIO Configuration'!$B$4:$C$97,2,FALSE)),0,1)","v":1},{"$f":"IF(ISNA(VLOOKUP($A23,'GPIO Configuration'!$B$4:$C$97,2,FALSE)),0,IF(VLOOKUP($A23,'GPIO Configuration'!$B$4:$C$97,2,FALSE)=\"是\",1,0))","v":1},{"$f":"IF(ISNA(VLOOKUP($A23,'GPIO Configuration'!$B$4:$D$97,3,FALSE)),\"\",TRIM(VLOOKUP($A23,'GPIO Configuration'!$B$4:$D$97,3,FALSE)))","v":"Line_In_Lbeam"},{"$f":"IF(ISNA(VLOOKUP($A23,'GPIO Configuration'!$B$4:$E$97,4,FALSE)),0,IF(VLOOKUP($A23,'GPIO Configuration'!$B$4:$E$97,4,FALSE)=\"OUT - 输出\",1,0))","v":0},{"$f":"IF(ISNA(VLOOKUP($A23,'GPIO Configuration'!$B$4:$F$97,5,FALSE)),0,IF(VLOOKUP($A23,'GPIO Configuration'!$B$4:$F$97,5,FALSE)=\"1 - 高电平\",1,0))","v":0},{"$f":"IF(ISNA(VLOOKUP($A23,'GPIO Configuration'!$B$4:$K$97,10,FALSE)),0,IF(VLOOKUP($A23,'GPIO Configuration'!$B$4:$K$97,10,FALSE)=\"1 - 使能\",1,0))","v":1},{"$f":"IF(ISNA(VLOOKUP($A23,'GPIO Configuration'!$B$4:$J$97,9,FALSE)),0,MATCH(VLOOKUP($A23,'GPIO Configuration'!$B$4:$J$97,9,FALSE),INDIRECT($A23&\"_InLv\"),0)-1)","v":0},{"$f":"IF(ISNA(VLOOKUP($A23,'GPIO Configuration'!$B$4:$L$97,11,FALSE)),0,IF(VLOOKUP($A23,'GPIO Configuration'!$B$4:$L$97,11,FALSE)=\"1 - 使能\",1,0))","v":1},{"$f":"IF(ISNA(VLOOKUP($A23,'GPIO Configuration'!$B$4:$I$97,8,FALSE)),0,IF(VLOOKUP($A23,'GPIO Configuration'!$B$4:$I$97,8,FALSE)=\"上拉\",2,IF(VLOOKUP($A23,'GPIO Configuration'!$B$4:$I$97,8,FALSE)=\"下拉\",1,0)))","v":0},{"$f":"IF(ISNA(VLOOKUP($A23,'GPIO Configuration'!$B$4:$G$97,6,FALSE)),0,MATCH(VLOOKUP($A23,'GPIO Configuration'!$B$4:$G$97,6,FALSE),INDIRECT($A23&\"_Func\"),0)-1)","v":0},{"$f":"IF(ISNA(VLOOKUP($A23,'GPIO Configuration'!$B$4:$H$97,7,FALSE)),0,MATCH(VLOOKUP($A23,'GPIO Configuration'!$B$4:$H$97,7,FALSE),INDIRECT($A23&\"_OutDrv\"),0)-1)","v":2},{"$f":"IF(ISNA(VLOOKUP($A23,'GPIO Configuration'!$B$4:$M$97,12,FALSE)),0,IF(VLOOKUP($A23,'GPIO Configuration'!$B$4:$M$97,12,FALSE)=\"OUT - 输出\",1,0))","v":0},{"$f":"IF(ISNA(VLOOKUP($A23,'GPIO Configuration'!$B$4:$N$97,13,FALSE)),0,IF(VLOOKUP($A23,'GPIO Configuration'!$B$4:$N$97,13,FALSE)=\"1 - 高电平\",1,0))","v":0},{"$f":"IF(ISNA(VLOOKUP($A23,'GPIO Configuration'!$B$4:$S$97,18,FALSE)),0,IF(VLOOKUP($A23,'GPIO Configuration'!$B$4:$S$97,18,FALSE)=\"1 - 使能\",1,0))","v":0},{"$f":"IF(ISNA(VLOOKUP($A23,'GPIO Configuration'!$B$4:$R$97,17,FALSE)),0,MATCH(VLOOKUP($A23,'GPIO Configuration'!$B$4:$R$97,17,FALSE),INDIRECT($A23&\"_InLv\"),0)-1)","v":0},{"$f":"IF(ISNA(VLOOKUP($A23,'GPIO Configuration'!$B$4:$T$97,19,FALSE)),0,IF(VLOOKUP($A23,'GPIO Configuration'!$B$4:$T$97,19,FALSE)=\"1 - 使能\",1,0))","v":1},{"$f":"IF(ISNA(VLOOKUP($A23,'GPIO Configuration'!$B$4:$Q$97,16,FALSE)),0,IF(VLOOKUP($A23,'GPIO Configuration'!$B$4:$Q$97,16,FALSE)=\"上拉\",2,IF(VLOOKUP($A23,'GPIO Configuration'!$B$4:$Q$97,16,FALSE)=\"下拉\",1,0)))","v":0},{"$f":"IF(ISNA(VLOOKUP($A23,'GPIO Configuration'!$B$4:$O$97,14,FALSE)),0,MATCH(VLOOKUP($A23,'GPIO Configuration'!$B$4:$O$97,14,FALSE),INDIRECT($A23&\"_Func\"),0)-1)","v":0},{"$f":"IF(ISNA(VLOOKUP($A23,'GPIO Configuration'!$B$4:$P$97,15,FALSE)),0,MATCH(VLOOKUP($A23,'GPIO Configuration'!$B$4:$P$97,15,FALSE),INDIRECT($A23&\"_OutDrv\"),0)-1)","v":0}]
["P0_21",0,21,"0x0015","GPIO_PODR0_POD21","GPIO_PIDR0_PID21",{"$f":"IF(ISNA(VLOOKUP($A24,'GPIO Configuration'!$B$4:$C$97,2,FALSE)),0,1)","v":1},{"$f":"IF(ISNA(VLOOKUP($A24,'GPIO Configuration'!$B$4:$C$97,2,FALSE)),0,IF(VLOOKUP($A24,'GPIO Configuration'!$B$4:$C$97,2,FALSE)=\"是\",1,0))","v":1},{"$f":"IF(ISNA(VLOOKUP($A24,'GPIO Configuration'!$B$4:$D$97,3,FALSE)),\"\",TRIM(VLOOKUP($A24,'GPIO Configuration'!$B$4:$D$97,3,FALSE)))","v":"Line_In_Position"},{"$f":"IF(ISNA(VLOOKUP($A24,'GPIO Configuration'!$B$4:$E$97,4,FALSE)),0,IF(VLOOKUP($A24,'GPIO Configuration'!$B$4:$E$97,4,FALSE)=\"OUT - 输出\",1,0))","v":0},{"$f":"IF(ISNA(VLOOKUP($A24,'GPIO Configuration'!$B$4:$F$97,5,FALSE)),0,IF(VLOOKUP($A24,'GPIO Configuration'!$B$4:$F$97,5,FALSE)=\"1 - 高电平\",1,0))","v":0},{"$f":"IF(ISNA(VLOOKUP($A24,'GPIO Configuration'!$B$4:$K$97,10,FALSE)),0,IF(VLOOKUP($A24,'GPIO Configuration'!$B$4:$K$97,10,FALSE)=\"1 - 使能\",1,0))","v":1},{"$f":"IF(ISNA(VLOOKUP($A24,'GPIO Configuration'!$B$4:$J$97,9,FALSE)),0,MATCH(VLOOKUP($A24,'GPIO Configuration'!$B$4:$J$97,9,FALSE),INDIRECT($A24&\"_InLv\"),0)-1)","v":0},{"$f":"IF(ISNA(VLOOKUP($A24,'GPIO Configuration'!$B$4:$L$97,11,FALSE)),0,IF(VLOOKUP($A24,'GPIO Configuration'!$B$4:$L$97,11,FALSE)=\"1 - 使能\",1,0))","v":1},{"$f":"IF(ISNA(VLOOKUP($A24,'GPIO Configuration'!$B$4:$I$97,8,FALSE)),0,IF(VLOOKUP($A24,'GPIO Configuration'!$B$4:$I$97,8,FALSE)=\"上拉\",2,IF(VLOOKUP($A24,'GPIO Configuration'!$B$4:$I$97,8,FALSE)=\"下拉\",1,0)))","v":0},{"$f":"IF(ISNA(VLOOKUP($A24,'GPIO Configuration'!$B$4:$G$97,6,FALSE)),0,MATCH(VLOOKUP($A24,'GPIO Configuration'!$B$4:$G$97,6,FALSE),INDIRECT($A24&\"_Func\"),0)-1)","v":0},{"$f":"IF(ISNA(VLOOKUP($A24,'GPIO Configuration'!$B$4:$H$97,7,FALSE)),0,MATCH(VLOOKUP($A24,'GPIO Configuration'!$B$4:$H$97,7,FALSE),INDIRECT($A24&\"_OutDrv\"),0)-1)","v":2},{"$f":"IF(ISNA(VLOOKUP($A24,'GPIO Configuration'!$B$4:$M$97,12,FALSE)),0,IF(VLOOKUP($A24,'GPIO Configuration'!$B$4:$M$97,12,FALSE)=\"OUT - 输出\",1,0))","v":0},{"$f":"IF(ISNA(VLOOKUP($A24,'GPIO Configuration'!$B$4:$N$97,13,FALSE)),0,IF(VLOOKUP($A24,'GPIO Configuration'!$B$4:$N$97,13,FALSE)=\"1 - 高电平\",1,0))","v":0},{"$f":"IF(ISNA(VLOOKUP($A24,'GPIO Configuration'!$B$4:$S$97,18,FALSE)),0,IF(VLOOKUP($A24,'GPIO Configuration'!$B$4:$S$97,18,FALSE)=\"1 - 使能\",1,0))","v":0},{"$f":"IF(ISNA(VLOOKUP($A24,'GPIO Configuration'!$B$4:$R$97,17,FALSE)),0,MATCH(VLOOKUP($A24,'GPIO Configuration'!$B$4:$R$97,17,FALSE),INDIRECT($A24&\"_InLv\"),0)-1)","v":0},{"$f":"IF(ISNA(VLOOKUP($A24,'GPIO Configuration'!$B$4:$T$97,19,FALSE)),0,IF(VLOOKUP($A24,'GPIO Configuration'!$B$4:$T$97,19,FALSE)=\"1 - 使能\",1,0))","v":1},{"$f":"IF(ISNA(VLOOKUP($A24,'GPIO Configuration'!$B$4:$Q$97,16,FALSE)),0,IF(VLOOKUP($A24,'GPIO Configuration'!$B$4:$Q$97,16,FALSE)=\"上拉\",2,IF(VLOOKUP($A24,'GPIO Configuration'!$B$4:$Q$97,16,FALSE)=\"下拉\",1,0)))","v":0},{"$f":"IF(ISNA(VLOOKUP($A24,'GPIO Configuration'!$B$4:$O$97,14,FALSE)),0,MATCH(VLOOKUP($A24,'GPIO Configuration'!$B$4:$O$97,14,FALSE),INDIRECT($A24&\"_Func\"),0)-1)","v":0},{"$f":"IF(ISNA(VLOOKUP($A24,'GPIO Configuration'!$B$4:$P$97,15,FALSE)),0,MATCH(VLOOKUP($A24,'GPIO Configuration'!$B$4:$P$97,15,FALSE),INDIRECT($A24&\"_OutDrv\"),0)-1)","v":0}]
["P0_22",0,22,"0x0016","GPIO_PODR0_POD22","GPIO_PIDR0_PID22",{"$f":"IF(ISNA(VLOOKUP($A25,'GPIO Configuration'!$B$4:$C$97,2,FALSE)),0,1)","v":1},{"$f":"IF(ISNA(VLOOKUP($A25,'GPIO Configuration'!$B$4:$C$97,2,FALSE)),0,IF(VLOOKUP($A25,'GPIO Configuration'!$B$4:$C$97,2,FALSE)=\"是\",1,0))","v":1},{"$f":"IF(ISNA(VLOOKUP($A25,'GPIO Configuration'!$B$4:$D$97,3,FALSE)),\"\",TRIM(VLOOKUP($A25,'GPIO Configuration'!$B$4:$D$97,3,FALSE)))","v":"Line_In_RearFog"},{"$f":"IF(ISNA(VLOOKUP($A25,'GPIO Configuration'!$B$4:$E$97,4,FALSE)),0,IF(VLOOKUP($A25,'GPIO Configuration'!$B$4:$E$97,4,FALSE)=\"OUT - 输出\",1,0))","v":0},{"$f":"IF(ISNA(VLOOKUP($A25,'GPIO Configuration'!$B$4:$F$97,5,FALSE)),0,IF(VLOOKUP($A25,'GPIO Configuration'!$B$4:$F$97,5,FALSE)=\"1 - 高电平\",1,0))","v":0},{"$f":"IF(ISNA(VLOOKUP($A25,'GPIO Configuration'!$B$4:$K$97,10,FALSE)),0,IF(VLOOKUP($A25,'GPIO Configuration'!$B$4:$K$97,10,FALSE)=\"1 - 使能\",1,0))","v":1},{"$f":"IF(ISNA(VLOOKUP($A25,'GPIO Configuration'!$B$4:$J$97,9,FALSE)),0,MATCH(VLOOKUP($A25,'GPIO Configuration'!$B$4:$J$97,9,FALSE),INDIRECT($A25&\"_InLv\"),0)-1)","v":0},{"$f":"IF(ISNA(VLOOKUP($A25,'GPIO Configuration'!$B$4:$L$97,11,FALSE)),0,IF(VLOOKUP($A25,'GPIO Configuration'!$B$4:$L$97,11,FALSE)=\"1 - 使能\",1,0))","v":1},{"$f":"IF(ISNA(VLOOKUP($A25,'GPIO Configuration'!$B$4:$I$97,8,FALSE)),0,IF(VLOOKUP($A25,'GPIO Configuration'!$B$4:$I$97,8,FALSE)=\"上拉\",2,IF(VLOOKUP($A25,'GPIO Configuration'!$B$4:$I$97,8,FALSE)=\"下拉\",1,0)))","v":0},{"$f":"IF(ISNA(VLOOKUP($A25,'GPIO Configuration'!$B$4:$G$97,6,FALSE)),0,MATCH(VLOOKUP($A25,'GPIO Configuration'!$B$4:$G$97,6,FALSE),INDIRECT($A25&\"_Func\"),0)-1)","v":0},{"$f":"IF(ISNA(VLOOKUP($A25,'GPIO Configuration'!$B$4:$H$97,7,FALSE)),0,MATCH(VLOOKUP($A25,'GPIO Configuration'!$B$4:$H$97,7,FALSE),INDIRECT($A25&\"_OutDrv\"),0)-1)","v":2},{"$f":"IF(ISNA(VLOOKUP($A25,'GPIO Configuration'!$B$4:$M$97,12,FALSE)),0,IF(VLOOKUP($A25,'GPIO Configuration'!$B$4:$M$97,12,FALSE)=\"OUT - 输出\",1,0))","v":0},{"$f":"IF(ISNA(VLOOKUP($A25,'GPIO Configuration'!$B$4:$N$97,13,FALSE)),0,IF(VLOOKUP($A25,'GPIO Configuration'!$B$4:$N$97,13,FALSE)=\"1 - 高电平\",1,0))","v":0},{"$f":"IF(ISNA(VLOOKUP($A25,'GPIO Configuration'!$B$4:$S$97,18,FALSE)),0,IF(VLOOKUP($A25,'GPIO Configuration'!$B$4:$S$97,18,FALSE)=\"1 - 使能\",1,0))","v":0},{"$f":"IF(ISNA(VLOOKUP($A25,'GPIO Configuration'!$B$4:$R$97,17,FALSE)),0,MATCH(VLOOKUP($A25,'GPIO Configuration'!$B$4:$R$97,17,FALSE),INDIRECT($A25&\"_InLv\"),0)-1)","v":0},{"$f":"IF(ISNA(VLOOKUP($A25,'GPIO Configuration'!$B$4:$T$97,19,FALSE)),0,IF(VLOOKUP($A25,'GPIO Configuration'!$B$4:$T$97,19,FALSE)=\"1 - 使能\",1,0))","v":1},{"$f":"IF(ISNA(VLOOKUP($A25,'GPIO Configuration'!$B$4:$Q$97,16,FALSE)),0,IF(VLOOKUP($A25,'GPIO Configuration'!$B$4:$Q$97,16,FALSE)=\"上拉\",2,IF(VLOOKUP($A25,'GPIO Configuration'!$B$4:$Q$97,16,FALSE)=\"下拉\",1,0)))","v":0},{"$f":"IF(ISNA(VLOOKUP($A25,'GPIO Configuration'!$B$4:$O$97,14,FALSE)),0,MATCH(VLOOKUP($A25,'GPIO Configuration'!$B$4:$O$97,14,FALSE),INDIRECT($A25&\"_Func\"),0)-1)","v":0},{"$f":"IF(ISNA(VLOOKUP($A25,'GPIO Configuration'!$B$4:$P$97,15,FALSE)),0,MATCH(VLOOKUP($A25,'GPIO Configuration'!$B$4:$P$97,15,FALSE),INDIRECT($A25&\"_OutDrv\"),0)-1)","v":0}]
["P0_23",0,23,"0x0017","GPIO_PODR0_POD23","GPIO_PIDR0_PID23",{"$f":"IF(ISNA(VLOOKUP($A26,'GPIO Configuration'!$B$4:$C$97,2,FALSE)),0,1)","v":1},{"$f":"IF(ISNA(VLOOKUP($A26,'GPIO Configuration'!$B$4:$C$97,2,FALSE)),0,IF(VLOOKUP($A26,'GPIO Configuration'!$B$4:$C$97,2,FALSE)=\"是\",1,0))","v":1},{"$f":"IF(ISNA(VLOOKUP($A26,'GPIO Configuration'!$B$4:$D$97,3,FALSE)),\"\",TRIM(VLOOKUP($A26,'GPIO Configuration'!$B$4:$D$97,3,FALSE)))","v":"Line_In_Daylight"},{"$f":"IF(ISNA(VLOOKUP($A26,'GPIO Configuration'!$B$4:$E$97,4,FALSE)),0,IF(VLOOKUP($A26,'GPIO Configuration'!$B$4:$E$97,4,FALSE)=\"OUT - 输出\",1,0))","v":0},{"$f":"IF(ISNA(VLOOKUP($A26,'GPIO Configuration'!$B$4:$F$97,5,FALSE)),0,IF(VLOOKUP($A26,'GPIO Configuration'!$B$4:$F$97,5,FALSE)=\"1 - 高电平\",1,0))","v":0},{"$f":"IF(ISNA(VLOOKUP($A26,'GPIO Configuration'!$B$4:$K$97,10,FALSE)),0,IF(VLOOKUP($A26,'GPIO Configuration'!$B$4:$K$97,10,FALSE)=\"1 - 使能\",1,0))","v":1},{"$f":"IF(ISNA(VLOOKUP($A26,'GPIO Configuration'!$B$4:$J$97,9,FALSE)),0,MATCH(VLOOKUP($A26,'GPIO Configuration'!$B$4:$J$97,9,FALSE),INDIRECT($A26&\"_InLv\"),0)-1)","v":0},{"$f":"IF(ISNA(VLOOKUP($A26,'GPIO Configuration'!$B$4:$L$97,11,FALSE)),0,IF(VLOOKUP($A26,'GPIO Configuration'!$B$4:$L$97,11,FALSE)=\"1 - 使能\",1,0))","v":1},{"$f":"IF(ISNA(VLOOKUP($A26,'GPIO Configuration'!$B$4:$I$97,8,FALSE)),0,IF(VLOOKUP($A26,'GPIO Configuration'!$B$4:$I$97,8,FALSE)=\"上拉\",2,IF(VLOOKUP($A26,'GPIO Configuration'!$B$4:$I$97,8,FALSE)=\"下拉\",1,0)))","v":0},{"$f":"IF(ISNA(VLOOKUP($A26,'GPIO Configuration'!$B$4:$G$97,6,FALSE)),0,MATCH(VLOOKUP($A26,'GPIO Configuration'!$B$4:$G$97,6,FALSE),INDIRECT($A26&\"_Func\"),0)-1)","v":0},{"$f":"IF(ISNA(VLOOKUP($A26,'GPIO Configuration'!$B$4:$H$97,7,FALSE)),0,MATCH(VLOOKUP($A26,'GPIO Configuration'!$B$4:$H$97,7,FALSE),INDIRECT($A26&\"_OutDrv\"),0)-1)","v":2},{"$f":"IF(ISNA(VLOOKUP($A26,'GPIO Configuration'!$B$4:$M$97,12,FALSE)),0,IF(VLOOKUP($A26,'GPIO Configuration'!$B$4:$M$97,12,FALSE)=\"OUT - 输出\",1,0))","v":0},{"$f":"IF(ISNA(VLOOKUP($A26,'GPIO Configuration'!$B$4:$N$97,13,FALSE)),0,IF(VLOOKUP($A26,'GPIO Configuration'!$B$4:$N$97,13,FALSE)=\"1 - 高电平\",1,0))","v":0},{"$f":"IF(ISNA(VLOOKUP($A26,'GPIO Configuration'!$B$4:$S$97,18,FALSE)),0,IF(VLOOKUP($A26,'GPIO Configuration'!$B$4:$S$97,18,FALSE)=\"1 - 使能\",1,0))","v":0},{"$f":"IF(ISNA(VLOOKUP($A26,'GPIO Configuration'!$B$4:$R$97,17,FALSE)),0,MATCH(VLOOKUP($A26,'GPIO Configuration'!$B$4:$R$97,17,FALSE),INDIRECT($A26&\"_InLv\"),0)-1)","v":0},{"$f":"IF(ISNA(VLOOKUP($A26,'GPIO Configuration'!$B$4:$T$97,19,FALSE)),0,IF(VLOOKUP($A26,'GPIO Configuration'!$B$4:$T$97,19,FALSE)=\"1 - 使能\",1,0))","v":1},{"$f":"IF(ISNA(VLOOKUP($A26,'GPIO Configuration'!$B$4:$Q$97,16,FALSE)),0,IF(VLOOKUP($A26,'GPIO Configuration'!$B$4:$Q$97,16,FALSE)=\"上拉\",2,IF(VLOOKUP($A26,'GPIO Configuration'!$B$4:$Q$97,16,FALSE)=\"下拉\",1,0)))","v":0},{"$f":"IF(ISNA(VLOOKUP($A26,'GPIO Configuration'!$B$4:$O$97,14,FALSE)),0,MATCH(VLOOKUP($A26,'GPIO Configuration'!$B$4:$O$97,14,FALSE),INDIRECT($A26&\"_Func\"),0)-1)","v":0},{"$f":"IF(ISNA(VLOOKUP($A26,'GPIO Configuration'!$B$4:$P$97,15,FALSE)),0,MATCH(VLOOKUP($A26,'GPIO Configuration'!$B$4:$P$97,15,FALSE),INDIRECT($A26&\"_OutDrv\"),0)-1)","v":0}]
["P0_24",0,24,"0x0018","GPIO_PODR0_POD24","GPIO_PIDR0_PID24",{"$f":"IF(ISNA(VLOOKUP($A27,'GPIO Configuration'!$B$4:$C$97,2,FALSE)),0,1)","v":1},{"$f":"IF(ISNA(VLOOKUP($A27,'GPIO Configuration'!$B$4:$C$97,2,FALSE)),0,IF(VLOOKUP($A27,'GPIO Configuration'!$B$4:$C$97,2,FALSE)=\"是\",1,0))","v":1},{"$f":"IF(ISNA(VLOOKUP($A27,'GPIO Configuration'!$B$4:$D$97,3,FALSE)),\"\",TRIM(VLOOKUP($A27,'GPIO Configuration'!$B$4:$D$97,3,FALSE)))","v":"Line_In_Handbrake"},{"$f":"IF(ISNA(VLOOKUP($A27,'GPIO Configuration'!$B$4:$E$97,4,FALSE)),0,IF(VLOOKUP($A27,'GPIO Configuration'!$B$4:$E$97,4,FALSE)=\"OUT - 输出\",1,0))","v":0},{"$f":"IF(ISNA(VLOOKUP($A27,'GPIO Configuration'!$B$4:$F$97,5,FALSE)),0,IF(VLOOKUP($A27,'GPIO Configuration'!$B$4:$F$97,5,FALSE)=\"1 - 高电平\",1,0))","v":0},{"$f":"IF(ISNA(VLOOKUP($A27,'GPIO Configuration'!$B$4:$K$97,10,FALSE)),0,IF(VLOOKUP($A27,'GPIO Configuration'!$B$4:$K$97,10,FALSE)=\"1 - 使能\",1,0))","v":1},{"$f":"IF(ISNA(VLOOKUP($A27,'GPIO Configuration'!$B$4:$J$97,9,FALSE)),0,MATCH(VLOOKUP($A27,'GPIO Configuration'!$B$4:$J$97,9,FALSE),INDIRECT($A27&\"_InLv\"),0)-1)","v":0},{"$f":"IF(ISNA(VLOOKUP($A27,'GPIO Configuration'!$B$4:$L$97,11,FALSE)),0,IF(VLOOKUP($A27,'GPIO Configuration'!$B$4:$L$97,11,FALSE)=\"1 - 使能\",1,0))","v":1},{"$f":"IF(ISNA(VLOOKUP($A27,'GPIO Configuration'!$B$4:$I$97,8,FALSE)),0,IF(VLOOKUP($A27,'GPIO Configuration'!$B$4:$I$97,8,FALSE)=\"上拉\",2,IF(VLOOKUP($A27,'GPIO Configuration'!$B$4:$I$97,8,FALSE)=\"下拉\",1,0)))","v":0},{"$f":"IF(ISNA(VLOOKUP($A27,'GPIO Configuration'!$B$4:$G$97,6,FALSE)),0,MATCH(VLOOKUP($A27,'GPIO Configuration'!$B$4:$G$97,6,FALSE),INDIRECT($A27&\"_Func\"),0)-1)","v":0},{"$f":"IF(ISNA(VLOOKUP($A27,'GPIO Configuration'!$B$4:$H$97,7,FALSE)),0,MATCH(VLOOKUP($A27,'GPIO Configuration'!$B$4:$H$97,7,FALSE),INDIRECT($A27&\"_OutDrv\"),0)-1)","v":2},{"$f":"IF(ISNA(VLOOKUP($A27,'GPIO Configuration'!$B$4:$M$97,12,FALSE)),0,IF(VLOOKUP($A27,'GPIO Configuration'!$B$4:$M$97,12,FALSE)=\"OUT - 输出\",1,0))","v":0},{"$f":"IF(ISNA(VLOOKUP($A27,'GPIO Configuration'!$B$4:$N$97,13,FALSE)),0,IF(VLOOKUP($A27,'GPIO Configuration'!$B$4:$N$97,13,FALSE)=\"1 - 高电平\",1,0))","v":0},{"$f":"IF(ISNA(VLOOKUP($A27,'GPIO Configuration'!$B$4:$S$97,18,FALSE)),0,IF(VLOOKUP($A27,'GPIO Configuration'!$B$4:$S$97,18,FALSE)=\"1 - 使能\",1,0))","v":0},{"$f":"IF(ISNA(VLOOKUP($A27,'GPIO Configuration'!$B$4:$R$97,17,FALSE)),0,MATCH(VLOOKUP($A27,'GPIO Configuration'!$B$4:$R$97,17,FALSE),INDIRECT($A27&\"_InLv\"),0)-1)","v":0},{"$f":"IF(ISNA(VLOOKUP($A27,'GPIO Configuration'!$B$4:$T$97,19,FALSE)),0,IF(VLOOKUP($A27,'GPIO Configuration'!$B$4:$T$97,19,FALSE)=\"1 - 使能\",1,0))","v":1},{"$f":"IF(ISNA(VLOOKUP($A27,'GPIO Configuration'!$B$4:$Q$97,16,FALSE)),0,IF(VLOOKUP($A27,'GPIO Configuration'!$B$4:$Q$97,16,FALSE)=\"上拉\",2,IF(VLOOKUP($A27,'GPIO Configuration'!$B$4:$Q$97,16,FALSE)=\"下拉\",1,0)))","v":0},{"$f":"IF(ISNA(VLOOKUP($A27,'GPIO Configuration'!$B$4:$O$97,14,FALSE)),0,MATCH(VLOOKUP($A27,'GPIO Configuration'!$B$4:$O$97,14,FALSE),INDIRECT($A27&\"_Func\"),0)-1)","v":0},{"$f":"IF(ISNA(VLOOKUP($A27,'GPIO Configuration'!$B$4:$P$97,15,FALSE)),0,MATCH(VLOOKUP($A27,'GPIO Configuration'!$B$4:$P$97,15,FALSE),INDIRECT($A27&\"_OutDrv\"),0)-1)","v":0}]
["P0_25",0,25,"0x0019","GPIO_PODR0_POD25","GPIO_PIDR0_PID25",{"$f":"IF(ISNA(VLOOKUP($A28,'GPIO Configuration'!$B$4:$C$97,2,FALSE)),0,1)","v":1},{"$f":"IF(ISNA(VLOOKUP($A28,'GPIO Configuration'!$B$4:$C$97,2,FALSE)),0,IF(VLOOKUP($A28,'GPIO Configuration'!$B$4:$C$97,2,FALSE)=\"是\",1,0))","v":0},{"$f":"IF(ISNA(VLOOKUP($A28,'GPIO Configuration'!$B$4:$D$97,3,FALSE)),\"\",TRIM(VLOOKUP($A28,'GPIO Configuration'!$B$4:$D$97,3,FALSE)))","v":"CAN0_RX"},{"$f":"IF(ISNA(VLOOKUP($A28,'GPIO Configuration'!$B$4:$E$97,4,FALSE)),0,IF(VLOOKUP($A28,'GPIO Configuration'!$B$4:$E$97,4,FALSE)=\"OUT - 输出\",1,0))","v":0},{"$f":"IF(ISNA(VLOOKUP($A28,'GPIO Configuration'!$B$4:$F$97,5,FALSE)),0,IF(VLOOKUP($A28,'GPIO Configuration'!$B$4:$F$97,5,FALSE)=\"1 - 高电平\",1,0))","v":1},{"$f":"IF(ISNA(VLOOKUP($A28,'GPIO Configuration'!$B$4:$K$97,10,FALSE)),0,IF(VLOOKUP($A28,'GPIO Configuration'!$B$4:$K$97,10,FALSE)=\"1 - 使能\",1,0))","v":1},{"$f":"IF(ISNA(VLOOKUP($A28,'GPIO Configuration'!$B$4:$J$97,9,FALSE)),0,MATCH(VLOOKUP($A28,'GPIO Configuration'!$B$4:$J$97,9,FALSE),INDIRECT($A28&\"_InLv\"),0)-1)","v":0},{"$f":"IF(ISNA(VLOOKUP($A28,'GPIO Configuration'!$B$4:$L$97,11,FALSE)),0,IF(VLOOKUP($A28,'GPIO Configuration'!$B$4:$L$97,11,FALSE)=\"1 - 使能\",1,0))","v":0},{"$f":"IF(ISNA(VLOOKUP($A28,'GPIO Configuration'!$B$4:$I$97,8,FALSE)),0,IF(VLOOKUP($A28,'GPIO Configuration'!$B$4:$I$97,8,FALSE)=\"上拉\",2,IF(VLOOKUP($A28,'GPIO Configuration'!$B$4:$I$97,8,FALSE)=\"下拉\",1,0)))","v":0},{"$f":"IF(ISNA(VLOOKUP($A28,'GPIO Configuration'!$B$4:$G$97,6,FALSE)),0,MATCH(VLOOKUP($A28,'GPIO Configuration'!$B$4:$G$97,6,FALSE),INDIRECT($A28&\"_Func\"),0)-1)","v":0},{"$f":"IF(ISNA(VLOOKUP($A28,'GPIO Configuration'!$B$4:$H$97,7,FALSE)),0,MATCH(VLOOKUP($A28,'GPIO Configuration'!$B$4:$H$97,7,FALSE),INDIRECT($A28&\"_OutDrv\"),0)-1)","v":3},{"$f":"IF(ISNA(VLOOKUP($A28,'GPIO Configuration'!$B$4:$M$97,12,FALSE)),0,IF(VLOOKUP($A28,'GPIO Configuration'!$B$4:$M$97,12,FALSE)=\"OUT - 输出\",1,0))","v":0},{"$f":"IF(ISNA(VLOOKUP($A28,'GPIO Configuration'!$B$4:$N$97,13,FALSE)),0,IF(VLOOKUP($A28,'GPIO Configuration'!$B$4:$N$97,13,FALSE)=\"1 - 高电平\",1,0))","v":1},{"$f":"IF(ISNA(VLOOKUP($A28,'GPIO Configuration'!$B$4:$S$97,18,FALSE)),0,IF(VLOOKUP($A28,'GPIO Configuration'!$B$4:$S$97,18,FALSE)=\"1 - 使能\",1,0))","v":0},{"$f":"IF(ISNA(VLOOKUP($A28,'GPIO Configuration'!$B$4:$R$97,17,FALSE)),0,MATCH(VLOOKUP($A28,'GPIO Configuration'!$B$4:$R$97,17,FALSE),INDIRECT($A28&\"_InLv\"),0)-1)","v":0},{"$f":"IF(ISNA(VLOOKUP($A28,'GPIO Configuration'!$B$4:$T$97,19,FALSE)),0,IF(VLOOKUP($A28,'GPIO Configuration'!$B$4:$T$97,19,FALSE)=\"1 - 使能\",1,0))","v":0},{"$f":"IF(ISNA(VLOOKUP($A28,'GPIO Configuration'!$B$4:$Q$97,16,FALSE)),0,IF(VLOOKUP($A28,'GPIO Configuration'!$B$4:$Q$97,16,FALSE)=\"上拉\",2,IF(VLOOKUP($A28,'GPIO Configuration'!$B$4:$Q$97,16,FALSE)=\"下拉\",1,0)))","v":0},{"$f":"IF(ISNA(VLOOKUP($A28,'GPIO Configuration'!$B$4:$O$97,14,FALSE)),0,MATCH(VLOOKUP($A28,'GPIO Configuration'!$B$4:$O$97,14,FALSE),INDIRECT($A28&\"_Func\"),0)-1)","v":0},{"$f":"IF(ISNA(VLOOKUP($A28,'GPIO Configuration'!$B$4:$P$97,15,FALSE)),0,MATCH(VLOOKUP($A28,'GPIO Configuration'!$B$4:$P$97,15,FALSE),INDIRECT($A28&\"_OutDrv\"),0)-1)","v":0}]
["P0_26",0,26,"0x001A","GPIO_PODR0_POD26","GPIO_PIDR0_PID26",{"$f":"IF(ISNA(VLOOKUP($A29,'GPIO Configuration'!$B$4:$C$97,2,FALSE)),0,1)","v":1},{"$f":"IF(ISNA(VLOOKUP($A29,'GPIO Configuration'!$B$4:$C$97,2,FALSE)),0,IF(VLOOKUP($A29,'GPIO Configuration'!$B$4:$C$97,2,FALSE)=\"是\",1,0))","v":0},{"$f":"IF(ISNA(VLOOKUP($A29,'GPIO Configuration'!$B$4:$D$97,3,FALSE)),\"\",TRIM(VLOOKUP($A29,'GPIO Configuration'!$B$4:$D$97,3,FALSE)))","v":"CAN0_TX"},{"$f":"IF(ISNA(VLOOKUP($A29,'GPIO Configuration'!$B$4:$E$97,4,FALSE)),0,IF(VLOOKUP($A29,'GPIO Configuration'!$B$4:$E$97,4,FALSE)=\"OUT - 输出\",1,0))","v":1},{"$f":"IF(ISNA(VLOOKUP($A29,'GPIO Configuration'!$B$4:$F$97,5,FALSE)),0,IF(VLOOKUP($A29,'GPIO Configuration'!$B$4:$F$97,5,FALSE)=\"1 - 高电平\",1,0))","v":1},{"$f":"IF(ISNA(VLOOKUP($A29,'GPIO Configuration'!$B$4:$K$97,10,FALSE)),0,IF(VLOOKUP($A29,'GPIO Configuration'!$B$4:$K$97,10,FALSE)=\"1 - 使能\",1,0))","v":0},{"$f":"IF(ISNA(VLOOKUP($A29,'GPIO Configuration'!$B$4:$J$97,9,FALSE)),0,MATCH(VLOOKUP($A29,'GPIO Configuration'!$B$4:$J$97,9,FALSE),INDIRECT($A29&\"_InLv\"),0)-1)","v":0},{"$f":"IF(ISNA(VLOOKUP($A29,'GPIO Configuration'!$B$4:$L$97,11,FALSE)),0,IF(VLOOKUP($A29,'GPIO Configuration'!$B$4:$L$97,11,FALSE)=\"1 - 使能\",1,0))","v":1},{"$f":"IF(ISNA(VLOOKUP($A29,'GPIO Configuration'!$B$4:$I$97,8,FALSE)),0,IF(VLOOKUP($A29,'GPIO Configuration'!$B$4:$I$97,8,FALSE)=\"上拉\",2,IF(VLOOKUP($A29,'GPIO Configuration'!$B$4:$I$97,8,FALSE)=\"下拉\",1,0)))","v":0},{"$f":"IF(ISNA(VLOOKUP($A29,'GPIO Configuration'!$B$4:$G$97,6,FALSE)),0,MATCH(VLOOKUP($A29,'GPIO Configuration'!$B$4:$G$97,6,FALSE),INDIRECT($A29&\"_Func\"),0)-1)","v":2},{"$f":"IF(ISNA(VLOOKUP($A29,'GPIO Configuration'!$B$4:$H$97,7,FALSE)),0,MATCH(VLOOKUP($A29,'GPIO Configuration'!$B$4:$H$97,7,FALSE),INDIRECT($A29&\"_OutDrv\"),0)-1)","v":3},{"$f":"IF(ISNA(VLOOKUP($A29,'GPIO Configuration'!$B$4:$M$97,12,FALSE)),0,IF(VLOOKUP($A29,'GPIO Configuration'!$B$4:$M$97,12,FALSE)=\"OUT - 输出\",1,0))","v":1},{"$f":"IF(ISNA(VLOOKUP($A29,'GPIO Configuration'!$B$4:$N$97,13,FALSE)),0,IF(VLOOKUP($A29,'GPIO Configuration'!$B$4:$N$97,13,FALSE)=\"1 - 高电平\",1,0))","v":1},{"$f":"IF(ISNA(VLOOKUP($A29,'GPIO Configuration'!$B$4:$S$97,18,FALSE)),0,IF(VLOOKUP($A29,'GPIO Configuration'!$B$4:$S$97,18,FALSE)=\"1 - 使能\",1,0))","v":0},{"$f":"IF(ISNA(VLOOKUP($A29,'GPIO Configuration'!$B$4:$R$97,17,FALSE)),0,MATCH(VLOOKUP($A29,'GPIO Configuration'!$B$4:$R$97,17,FALSE),INDIRECT($A29&\"_InLv\"),0)-1)","v":0},{"$f":"IF(ISNA(VLOOKUP($A29,'GPIO Configuration'!$B$4:$T$97,19,FALSE)),0,IF(VLOOKUP($A29,'GPIO Configuration'!$B$4:$T$97,19,FALSE)=\"1 - 使能\",1,0))","v":1},{"$f":"IF(ISNA(VLOOKUP($A29,'GPIO Configuration'!$B$4:$Q$97,16,FALSE)),0,IF(VLOOKUP($A29,'GPIO Configuration'!$B$4:$Q$97,16,FALSE)=\"上拉\",2,IF(VLOOKUP($A29,'GPIO Configuration'!$B$4:$Q$97,16,FALSE)=\"下拉\",1,0)))","v":0},{"$f":"IF(ISNA(VLOOKUP($A29,'GPIO Configuration'!$B$4:$O$97,14,FALSE)),0,MATCH(VLOOKUP($A29,'GPIO Configuration'!$B$4:$O$97,14,FALSE),INDIRECT($A29&\"_Func\"),0)-1)","v":2},{"$f":"IF(ISNA(VLOOKUP($A29,'GPIO Configuration'!$B$4:$P$97,15,FALSE)),0,MATCH(VLOOKUP($A29,'GPIO Configuration'!$B$4:$P$97,15,FALSE),INDIRECT($A29&\"_OutDrv\"),0)-1)","v":0}]
["P0_27",0,27,"0x001B","GPIO_PODR0_POD27","GPIO_PIDR0_PID27",{"$f":"IF(ISNA(VLOOKUP($A30,'GPIO Configuration'!$B$4:$C$97,2,FALSE)),0,1)","v":1},{"$f":"IF(ISNA(VLOOKUP($A30,'GPIO Configuration'!$B$4:$C$97,2,FALSE)),0,IF(VLOOKUP($A30,'GPIO Configuration'!$B$4:$C$97,2,FALSE)=\"是\",1,0))","v":0},{"$f":"IF(ISNA(VLOOKUP($A30,'GPIO Configuration'!$B$4:$D$97,3,FALSE)),\"\",TRIM(VLOOKUP($A30,'GPIO Configuration'!$B$4:$D$97,3,FALSE)))","v":""},{"$f":"IF(ISNA(VLOOKUP($A30,'GPIO Configuration'!$B$4:$E$97,4,FALSE)),0,IF(VLOOKUP($A30,'GPIO Configuration'!$B$4:$E$97,4,FALSE)=\"OUT - 输出\",1,0))","v":0},{"$f":"IF(ISNA(VLOOKUP($A30,'GPIO Configuration'!$B$4:$F$97,5,FALSE)),0,IF(VLOOKUP($A30,'GPIO Configuration'!$B$4:$F$97,5,FALSE)=\"1 - 高电平\",1,0))","v":0},{"$f":"IF(ISNA(VLOOKUP($A30,'GPIO Configuration'!$B$4:$K$97,10,FALSE)),0,IF(VLOOKUP($A30,'GPIO Configuration'!$B$4:$K$97,10,FALSE)=\"1 - 使能\",1,0))","v":1},{"$f":"IF(ISNA(VLOOKUP($A30,'GPIO Configuration'!$B$4:$J$97,9,FALSE)),0,MATCH(VLOOKUP($A30,'GPIO Configuration'!$B$4:$J$97,9,FALSE),INDIRECT($A30&\"_InLv\"),0)-1)","v":0},{"$f":"IF(ISNA(VLOOKUP($A30,'GPIO Configuration'!$B$4:$L$97,11,FALSE)),0,IF(VLOOKUP($A30,'GPIO Configuration'!$B$4:$L$97,11,FALSE)=\"1 - 使能\",1,0))","v":0},{"$f":"IF(ISNA(VLOOKUP($A30,'GPIO Configuration'!$B$4:$I$97,8,FALSE)),0,IF(VLOOKUP($A30,'GPIO Configuration'!$B$4:$I$97,8,FALSE)=\"上拉\",2,IF(VLOOKUP($A30,'GPIO Configuration'!$B$4:$I$97,8,FALSE)=\"下拉\",1,0)))","v":0},{"$f":"IF(ISNA(VLOOKUP($A30,'GPIO Configuration'!$B$4:$G$97,6,FALSE)),0,MATCH(VLOOKUP($A30,'GPIO Configuration'!$B$4:$G$97,6,FALSE),INDIRECT($A30&\"_Func\"),0)-1)","v":0},{"$f":"IF(ISNA(VLOOKUP($A30,'GPIO Configuration'!$B$4:$H$97,7,FALSE)),0,MATCH(VLOOKUP($A30,'GPIO Configuration'!$B$4:$H$97,7,FALSE),INDIRECT($A30&\"_OutDrv\"),0)-1)","v":3},{"$f":"IF(ISNA(VLOOKUP($A30,'GPIO Configuration'!$B$4:$M$97,12,FALSE)),0,IF(VLOOKUP($A30,'GPIO Configuration'!$B$4:$M$97,12,FALSE)=\"OUT - 输出\",1,0))","v":0},{"$f":"IF(ISNA(VLOOKUP($A30,'GPIO Configuration'!$B$4:$N$97,13,FALSE)),0,IF(VLOOKUP($A30,'GPIO Configuration'!$B$4:$N$97,13,FALSE)=\"1 - 高电平\",1,0))","v":0},{"$f":"IF(ISNA(VLOOKUP($A30,'GPIO Configuration'!$B$4:$S$97,18,FALSE)),0,IF(VLOOKUP($A30,'GPIO Configuration'!$B$4:$S$97,18,FALSE)=\"1 - 使能\",1,0))","v":0},{"$f":"IF(ISNA(VLOOKUP($A30,'GPIO Configuration'!$B$4:$R$97,17,FALSE)),0,MATCH(VLOOKUP($A30,'GPIO Configuration'!$B$4:$R$97,17,FALSE),INDIRECT($A30&\"_InLv\"),0)-1)","v":0},{"$f":"IF(ISNA(VLOOKUP($A30,'GPIO Configuration'!$B$4:$T$97,19,FALSE)),0,IF(VLOOKUP($A30,'GPIO Configuration'!$B$4:$T$97,19,FALSE)=\"1 - 使能\",1,0))","v":1},{"$f":"IF(ISNA(VLOOKUP($A30,'GPIO Configuration'!$B$4:$Q$97,16,FALSE)),0,IF(VLOOKUP($A30,'GPIO Configuration'!$B$4:$Q$97,16,FALSE)=\"上拉\",2,IF(VLOOKUP($A30,'GPIO Configuration'!$B$4:$Q$97,16,FALSE)=\"下拉\",1,0)))","v":0},{"$f":"IF(ISNA(VLOOKUP($A30,'GPIO Configuration'!$B$4:$O$97,14,FALSE)),0,MATCH(VLOOKUP($A30,'GPIO Configuration'!$B$4:$O$97,14,FALSE),INDIRECT($A30&\"_Func\"),0)-1)","v":0},{"$f":"IF(ISNA(VLOOKUP($A30,'GPIO Configuration'!$B$4:$P$97,15,FALSE)),0,MATCH(VLOOKUP($A30,'GPIO Configuration'!$B$4:$P$97,15,FALSE),INDIRECT($A30&\"_OutDrv\"),0)-1)","v":0}]
["P0_28",0,28,"0x001C","GPIO_PODR0_POD28","GPIO_PIDR0_PID28",{"$f":"IF(ISNA(VLOOKUP($A31,'GPIO Configuration'!$B$4:$C$97,2,FALSE)),0,1)","v":1},{"$f":"IF(ISNA(VLOOKUP($A31,'GPIO Configuration'!$B$4:$C$97,2,FALSE)),0,IF(VLOOKUP($A31,'GPIO Configuration'!$B$4:$C$97,2,FALSE)=\"是\",1,0))","v":1},{"$f":"IF(ISNA(VLOOKUP($A31,'GPIO Configuration'!$B$4:$D$97,3,FALSE)),\"\",TRIM(VLOOKUP($A31,'GPIO Configuration'!$B$4:$D$97,3,FALSE)))","v":"DimmerSwitch_AD"},{"$f":"IF(ISNA(VLOOKUP($A31,'GPIO Configuration'!$B$4:$E$97,4,FALSE)),0,IF(VLOOKUP($A31,'GPIO Configuration'!$B$4:$E$97,4,FALSE)=\"OUT - 输出\",1,0))","v":0},{"$f":"IF(ISNA(VLOOKUP($A31,'GPIO Configuration'!$B$4:$F$97,5,FALSE)),0,IF(VLOOKUP($A31,'GPIO Configuration'!$B$4:$F$97,5,FALSE)=\"1 - 高电平\",1,0))","v":0},{"$f":"IF(ISNA(VLOOKUP($A31,'GPIO Configuration'!$B$4:$K$97,10,FALSE)),0,IF(VLOOKUP($A31,'GPIO Configuration'!$B$4:$K$97,10,FALSE)=\"1 - 使能\",1,0))","v":1},{"$f":"IF(ISNA(VLOOKUP($A31,'GPIO Configuration'!$B$4:$J$97,9,FALSE)),0,MATCH(VLOOKUP($A31,'GPIO Configuration'!$B$4:$J$97,9,FALSE),INDIRECT($A31&\"_InLv\"),0)-1)","v":0},{"$f":"IF(ISNA(VLOOKUP($A31,'GPIO Configuration'!$B$4:$L$97,11,FALSE)),0,IF(VLOOKUP($A31,'GPIO Configuration'!$B$4:$L$97,11,FALSE)=\"1 - 使能\",1,0))","v":1},{"$f":"IF(ISNA(VLOOKUP($A31,'GPIO Configuration'!$B$4:$I$97,8,FALSE)),0,IF(VLOOKUP($A31,'GPIO Configuration'!$B$4:$I$97,8,FALSE)=\"上拉\",2,IF(VLOOKUP($A31,'GPIO Configuration'!$B$4:$I$97,8,FALSE)=\"下拉\",1,0)))","v":0},{"$f":"IF(ISNA(VLOOKUP($A31,'GPIO Configuration'!$B$4:$G$97,6,FALSE)),0,MATCH(VLOOKUP($A31,'GPIO Configuration'!$B$4:$G$97,6,FALSE),INDIRECT($A31&\"_Func\"),0)-1)","v":0},{"$f":"IF(ISNA(VLOOKUP($A31,'GPIO Configuration'!$B$4:$H$97,7,FALSE)),0,MATCH(VLOOKUP($A31,'GPIO Configuration'!$B$4:$H$97,7,FALSE),INDIRECT($A31&\"_OutDrv\"),0)-1)","v":3},{"$f":"IF(ISNA(VLOOKUP($A31,'GPIO Configuration'!$B$4:$M$97,12,FALSE)),0,IF(VLOOKUP($A31,'GPIO Configuration'!$B$4:$M$97,12,FALSE)=\"OUT - 输出\",1,0))","v":0},{"$f":"IF(ISNA(VLOOKUP($A31,'GPIO Configuration'!$B$4:$N$97,13,FALSE)),0,IF(VLOOKUP($A31,'GPIO Configuration'!$B$4:$N$97,13,FALSE)=\"1 - 高电平\",1,0))","v":0},{"$f":"IF(ISNA(VLOOKUP($A31,'GPIO Configuration'!$B$4:$S$97,18,FALSE)),0,IF(VLOOKUP($A31,'GPIO Configuration'!$B$4:$S$97,18,FALSE)=\"1 - 使能\",1,0))","v":0},{"$f":"IF(ISNA(VLOOKUP($A31,'GPIO Configuration'!$B$4:$R$97,17,FALSE)),0,MATCH(VLOOKUP($A31,'GPIO Configuration'!$B$4:$R$97,17,FALSE),INDIRECT($A31&\"_InLv\"),0)-1)","v":0},{"$f":"IF(ISNA(VLOOKUP($A31,'GPIO Configuration'!$B$4:$T$97,19,FALSE)),0,IF(VLOOKUP($A31,'GPIO Configuration'!$B$4:$T$97,19,FALSE)=\"1 - 使能\",1,0))","v":1},{"$f":"IF(ISNA(VLOOKUP($A31,'GPIO Configuration'!$B$4:$Q$97,16,FALSE)),0,IF(VLOOKUP($A31,'GPIO Configuration'!$B$4:$Q$97,16,FALSE)=\"上拉\",2,IF(VLOOKUP($A31,'GPIO Configuration'!$B$4:$Q$97,16,FALSE)=\"下拉\",1,0)))","v":0},{"$f":"IF(ISNA(VLOOKUP($A31,'GPIO Configuration'!$B$4:$O$97,14,FALSE)),0,MATCH(VLOOKUP($A31,'GPIO Configuration'!$B$4:$O$97,14,FALSE),INDIRECT($A31&\"_Func\"),0)-1)","v":0},{"$f":"IF(ISNA(VLOOKUP($A31,'GPIO Configuration'!$B$4:$P$97,15,FALSE)),0,MATCH(VLOOKUP($A31,'GPIO Configuration'!$B$4:$P$97,15,FALSE),INDIRECT($A31&\"_OutDrv\"),0)-1)","v":0}]
["P0_29",0,29,"0x001D","GPIO_PODR0_POD29","GPIO_PIDR0_PID29",{"$f":"IF(ISNA(VLOOKUP($A32,'GPIO Configuration'!$B$4:$C$97,2,FALSE)),0,1)","v":1},{"$f":"IF(ISNA(VLOOKUP($A32,'GPIO Configuration'!$B$4:$C$97,2,FALSE)),0,IF(VLOOKUP($A32,'GPIO Configuration'!$B$4:$C$97,2,FALSE)=\"是\",1,0))","v":1},{"$f":"IF(ISNA(VLOOKUP($A32,'GPIO Configuration'!$B$4:$D$97,3,FALSE)),\"\",TRIM(VLOOKUP($A32,'GPIO Configuration'!$B$4:$D$97,3,FALSE)))","v":"CAN0_STB"},{"$f":"IF(ISNA(VLOOKUP($A32,'GPIO Configuration'!$B$4:$E$97,4,FALSE)),0,IF(VLOOKUP($A32,'GPIO Configuration'!$B$4:$E$97,4,FALSE)=\"OUT - 输出\",1,0))","v":1},{"$f":"IF(ISNA(VLOOKUP($A32,'GPIO Configuration'!$B$4:$F$97,5,FALSE)),0,IF(VLOOKUP($A32,'GPIO Configuration'!$B$4:$F$97,5,FALSE)=\"1 - 高电平\",1,0))","v":1},{"$f":"IF(ISNA(VLOOKUP($A32,'GPIO Configuration'!$B$4:$K$97,10,FALSE)),0,IF(VLOOKUP($A32,'GPIO Configuration'!$B$4:$K$97,10,FALSE)=\"1 - 使能\",1,0))","v":0},{"$f":"IF(ISNA(VLOOKUP($A32,'GPIO Configuration'!$B$4:$J$97,9,FALSE)),0,MATCH(VLOOKUP($A32,'GPIO Configuration'!$B$4:$J$97,9,FALSE),INDIRECT($A32&\"_InLv\"),0)-1)","v":0},{"$f":"IF(ISNA(VLOOKUP($A32,'GPIO Configuration'!$B$4:$L$97,11,FALSE)),0,IF(VLOOKUP($A32,'GPIO Configuration'!$B$4:$L$97,11,FALSE)=\"1 - 使能\",1,0))","v":1},{"$f":"IF(ISNA(VLOOKUP($A32,'GPIO Configuration'!$B$4:$I$97,8,FALSE)),0,IF(VLOOKUP($A32,'GPIO Configuration'!$B$4:$I$97,8,FALSE)=\"上拉\",2,IF(VLOOKUP($A32,'GPIO Configuration'!$B$4:$I$97,8,FALSE)=\"下拉\",1,0)))","v":0},{"$f":"IF(ISNA(VLOOKUP($A32,'GPIO Configuration'!$B$4:$G$97,6,FALSE)),0,MATCH(VLOOKUP($A32,'GPIO Configuration'!$B$4:$G$97,6,FALSE),INDIRECT($A32&\"_Func\"),0)-1)","v":0},{"$f":"IF(ISNA(VLOOKUP($A32,'GPIO Configuration'!$B$4:$H$97,7,FALSE)),0,MATCH(VLOOKUP($A32,'GPIO Configuration'!$B$4:$H$97,7,FALSE),INDIRECT($A32&\"_OutDrv\"),0)-1)","v":3},{"$f":"IF(ISNA(VLOOKUP($A32,'GPIO Configuration'!$B$4:$M$97,12,FALSE)),0,IF(VLOOKUP($A32,'GPIO Configuration'!$B$4:$M$97,12,FALSE)=\"OUT - 输出\",1,0))","v":1},{"$f":"IF(ISNA(VLOOKUP($A32,'GPIO Configuration'!$B$4:$N$97,13,FALSE)),0,IF(VLOOKUP($A32,'GPIO Configuration'!$B$4:$N$97,13,FALSE)=\"1 - 高电平\",1,0))","v":1},{"$f":"IF(ISNA(VLOOKUP($A32,'GPIO Configuration'!$B$4:$S$97,18,FALSE)),0,IF(VLOOKUP($A32,'GPIO Configuration'!$B$4:$S$97,18,FALSE)=\"1 - 使能\",1,0))","v":0},{"$f":"IF(ISNA(VLOOKUP($A32,'GPIO Configuration'!$B$4:$R$97,17,FALSE)),0,MATCH(VLOOKUP($A32,'GPIO Configuration'!$B$4:$R$97,17,FALSE),INDIRECT($A32&\"_InLv\"),0)-1)","v":0},{"$f":"IF(ISNA(VLOOKUP($A32,'GPIO Configuration'!$B$4:$T$97,19,FALSE)),0,IF(VLOOKUP($A32,'GPIO Configuration'!$B$4:$T$97,19,FALSE)=\"1 - 使能\",1,0))","v":1},{"$f":"IF(ISNA(VLOOKUP($A32,'GPIO Configuration'!$B$4:$Q$97,16,FALSE)),0,IF(VLOOKUP($A32,'GPIO Configuration'!$B$4:$Q$97,16,FALSE)=\"上拉\",2,IF(VLOOKUP($A32,'GPIO Configuration'!$B$4:$Q$97,16,FALSE)=\"下拉\",1,0)))","v":0},{"$f":"IF(ISNA(VLOOKUP($A32,'GPIO Configuration'!$B$4:$O$97,14,FALSE)),0,MATCH(VLOOKUP($A32,'GPIO Configuration'!$B$4:$O$97,14,FALSE),INDIRECT($A32&\"_Func\"),0)-1)","v":0},{"$f":"IF(ISNA(VLOOKUP($A32,'GPIO Configuration'!$B$4:$P$97,15,FALSE)),0,MATCH(VLOOKUP($A32,'GPIO Configuration'!$B$4:$P$97,15,FALSE),INDIRECT($A32&\"_OutDrv\"),0)-1)","v":0}]
["P0_30",0,30,"0x001E","GPIO_PODR0_POD30","GPIO_PIDR0_PID30",{"$f":"IF(ISNA(VLOOKUP($A33,'GPIO Configuration'!$B$4:$C$97,2,FALSE)),0,1)","v":1},{"$f":"IF(ISNA(VLOOKUP($A33,'GPIO Configuration'!$B$4:$C$97,2,FALSE)),0,IF(VLOOKUP($A33,'GPIO Configuration'!$B$4:$C$97,2,FALSE)=\"是\",1,0))","v":0},{"$f":"IF(ISNA(VLOOKUP($A33,'GPIO Configuration'!$B$4:$D$97,3,FALSE)),\"\",TRIM(VLOOKUP($A33,'GPIO Configuration'!$B$4:$D$97,3,FALSE)))","v":""},{"$f":"IF(ISNA(VLOOKUP($A33,'GPIO Configuration'!$B$4:$E$97,4,FALSE)),0,IF(VLOOKUP($A33,'GPIO Configuration'!$B$4:$E$97,4,FALSE)=\"OUT - 输出\",1,0))","v":0},{"$f":"IF(ISNA(VLOOKUP($A33,'GPIO Configuration'!$B$4:$F$97,5,FALSE)),0,IF(VLOOKUP($A33,'GPIO Configuration'!$B$4:$F$97,5,FALSE)=\"1 - 高电平\",1,0))","v":0},{"$f":"IF(ISNA(VLOOKUP($A33,'GPIO Configuration'!$B$4:$K$97,10,FALSE)),0,IF(VLOOKUP($A33,'GPIO Configuration'!$B$4:$K$97,10,FALSE)=\"1 - 使能\",1,0))","v":0},{"$f":"IF(ISNA(VLOOKUP($A33,'GPIO Configuration'!$B$4:$J$97,9,FALSE)),0,MATCH(VLOOKUP($A33,'GPIO Configuration'!$B$4:$J$97,9,FALSE),INDIRECT($A33&\"_InLv\"),0)-1)","v":0},{"$f":"IF(ISNA(VLOOKUP($A33,'GPIO Configuration'!$B$4:$L$97,11,FALSE)),0,IF(VLOOKUP($A33,'GPIO Configuration'!$B$4:$L$97,11,FALSE)=\"1 - 使能\",1,0))","v":1},{"$f":"IF(ISNA(VLOOKUP($A33,'GPIO Configuration'!$B$4:$I$97,8,FALSE)),0,IF(VLOOKUP($A33,'GPIO Configuration'!$B$4:$I$97,8,FALSE)=\"上拉\",2,IF(VLOOKUP($A33,'GPIO Configuration'!$B$4:$I$97,8,FALSE)=\"下拉\",1,0)))","v":0},{"$f":"IF(ISNA(VLOOKUP($A33,'GPIO Configuration'!$B$4:$G$97,6,FALSE)),0,MATCH(VLOOKUP($A33,'GPIO Configuration'!$B$4:$G$97,6,FALSE),INDIRECT($A33&\"_Func\"),0)-1)","v":0},{"$f":"IF(ISNA(VLOOKUP($A33,'GPIO Configuration'!$B$4:$H$97,7,FALSE)),0,MATCH(VLOOKUP($A33,'GPIO Configuration'!$B$4:$H$97,7,FALSE),INDIRECT($A33&\"_OutDrv\"),0)-1)","v":3},{"$f":"IF(ISNA(VLOOKUP($A33,'GPIO Configuration'!$B$4:$M$97,12,FALSE)),0,IF(VLOOKUP($A33,'GPIO Configuration'!$B$4:$M$97,12,FALSE)=\"OUT - 输出\",1,0))","v":0},{"$f":"IF(ISNA(VLOOKUP($A33,'GPIO Configuration'!$B$4:$N$97,13,FALSE)),0,IF(VLOOKUP($A33,'GPIO Configuration'!$B$4:$N$97,13,FALSE)=\"1 - 高电平\",1,0))","v":0},{"$f":"IF(ISNA(VLOOKUP($A33,'GPIO Configuration'!$B$4:$S$97,18,FALSE)),0,IF(VLOOKUP($A33,'GPIO Configuration'!$B$4:$S$97,18,FALSE)=\"1 - 使能\",1,0))","v":0},{"$f":"IF(ISNA(VLOOKUP($A33,'GPIO Configuration'!$B$4:$R$97,17,FALSE)),0,MATCH(VLOOKUP($A33,'GPIO Configuration'!$B$4:$R$97,17,FALSE),INDIRECT($A33&\"_InLv\"),0)-1)","v":0},{"$f":"IF(ISNA(VLOOKUP($A33,'GPIO Configuration'!$B$4:$T$97,19,FALSE)),0,IF(VLOOKUP($A33,'GPIO Configuration'!$B$4:$T$97,19,FALSE)=\"1 - 使能\",1,0))","v":1},{"$f":"IF(ISNA(VLOOKUP($A33,'GPIO Configuration'!$B$4:$Q$97,16,FALSE)),0,IF(VLOOKUP($A33,'GPIO Configuration'!$B$4:$Q$97,16,FALSE)=\"上拉\",2,IF(VLOOKUP($A33,'GPIO Configuration'!$B$4:$Q$97,16,FALSE)=\"下拉\",1,0)))","v":0},{"$f":"IF(ISNA(VLOOKUP($A33,'GPIO Configuration'!$B$4:$O$97,14,FALSE)),0,MATCH(VLOOKUP($A33,'GPIO Configuration'!$B$4:$O$97,14,FALSE),INDIRECT($A33&\"_Func\"),0)-1)","v":0},{"$f":"IF(ISNA(VLOOKUP($A33,'GPIO Configuration'!$B$4:$P$97,15,FALSE)),0,MATCH(VLOOKUP($A33,'GPIO Configuration'!$B$4:$P$97,15,FALSE),INDIRECT($A33&\"_OutDrv\"),0)-1)","v":0}]
["P0_31",0,31,"0x001F","GPIO_PODR0_POD31","GPIO_PIDR0_PID31",{"$f":"IF(ISNA(VLOOKUP($A34,'GPIO Configuration'!$B$4:$C$97,2,FALSE)),0,1)","v":1},{"$f":"IF(ISNA(VLOOKUP($A34,'GPIO Configuration'!$B$4:$C$97,2,FALSE)),0,IF(VLOOKUP($A34,'GPIO Configuration'!$B$4:$C$97,2,FALSE)=\"是\",1,0))","v":0},{"$f":"IF(ISNA(VLOOKUP($A34,'GPIO Configuration'!$B$4:$D$97,3,FALSE)),\"\",TRIM(VLOOKUP($A34,'GPIO Configuration'!$B$4:$D$97,3,FALSE)))","v":""},{"$f":"IF(ISNA(VLOOKUP($A34,'GPIO Configuration'!$B$4:$E$97,4,FALSE)),0,IF(VLOOKUP($A34,'GPIO Configuration'!$B$4:$E$97,4,FALSE)=\"OUT - 输出\",1,0))","v":0},{"$f":"IF(ISNA(VLOOKUP($A34,'GPIO Configuration'!$B$4:$F$97,5,FALSE)),0,IF(VLOOKUP($A34,'GPIO Configuration'!$B$4:$F$97,5,FALSE)=\"1 - 高电平\",1,0))","v":0},{"$f":"IF(ISNA(VLOOKUP($A34,'GPIO Configuration'!$B$4:$K$97,10,FALSE)),0,IF(VLOOKUP($A34,'GPIO Configuration'!$B$4:$K$97,10,FALSE)=\"1 - 使能\",1,0))","v":0},{"$f":"IF(ISNA(VLOOKUP($A34,'GPIO Configuration'!$B$4:$J$97,9,FALSE)),0,MATCH(VLOOKUP($A34,'GPIO Configuration'!$B$4:$J$97,9,FALSE),INDIRECT($A34&\"_InLv\"),0)-1)","v":0},{"$f":"IF(ISNA(VLOOKUP($A34,'GPIO Configuration'!$B$4:$L$97,11,FALSE)),0,IF(VLOOKUP($A34,'GPIO Configuration'!$B$4:$L$97,11,FALSE)=\"1 - 使能\",1,0))","v":1},{"$f":"IF(ISNA(VLOOKUP($A34,'GPIO Configuration'!$B$4:$I$97,8,FALSE)),0,IF(VLOOKUP($A34,'GPIO Configuration'!$B$4:$I$97,8,FALSE)=\"上拉\",2,IF(VLOOKUP($A34,'GPIO Configuration'!$B$4:$I$97,8,FALSE)=\"下拉\",1,0)))","v":0},{"$f":"IF(ISNA(VLOOKUP($A34,'GPIO Configuration'!$B$4:$G$97,6,FALSE)),0,MATCH(VLOOKUP($A34,'GPIO Configuration'!$B$4:$G$97,6,FALSE),INDIRECT($A34&\"_Func\"),0)-1)","v":0},{"$f":"IF(ISNA(VLOOKUP($A34,'GPIO Configuration'!$B$4:$H$97,7,FALSE)),0,MATCH(VLOOKUP($A34,'GPIO Configuration'!$B$4:$H$97,7,FALSE),INDIRECT($A34&\"_OutDrv\"),0)-1)","v":3},{"$f":"IF(ISNA(VLOOKUP($A34,'GPIO Configuration'!$B$4:$M$97,12,FALSE)),0,IF(VLOOKUP($A34,'GPIO Configuration'!$B$4:$M$97,12,FALSE)=\"OUT - 输出\",1,0))","v":0},{"$f":"IF(ISNA(VLOOKUP($A34,'GPIO Configuration'!$B$4:$N$97,13,FALSE)),0,IF(VLOOKUP($A34,'GPIO Configuration'!$B$4:$N$97,13,FALSE)=\"1 - 高电平\",1,0))","v":0},{"$f":"IF(ISNA(VLOOKUP($A34,'GPIO Configuration'!$B$4:$S$97,18,FALSE)),0,IF(VLOOKUP($A34,'GPIO Configuration'!$B$4:$S$97,18,FALSE)=\"1 - 使能\",1,0))","v":0},{"$f":"IF(ISNA(VLOOKUP($A34,'GPIO Configuration'!$B$4:$R$97,17,FALSE)),0,MATCH(VLOOKUP($A34,'GPIO Configuration'!$B$4:$R$97,17,FALSE),INDIRECT($A34&\"_InLv\"),0)-1)","v":0},{"$f":"IF(ISNA(VLOOKUP($A34,'GPIO Configuration'!$B$4:$T$97,19,FALSE)),0,IF(VLOOKUP($A34,'GPIO Configuration'!$B$4:$T$97,19,FALSE)=\"1 - 使能\",1,0))","v":1},{"$f":"IF(ISNA(VLOOKUP($A34,'GPIO Configuration'!$B$4:$Q$97,16,FALSE)),0,IF(VLOOKUP($A34,'GPIO Configuration'!$B$4:$Q$97,16,FALSE)=\"上拉\",2,IF(VLOOKUP($A34,'GPIO Configuration'!$B$4:$Q$97,16,FALSE)=\"下拉\",1,0)))","v":0},{"$f":"IF(ISNA(VLOOKUP($A34,'GPIO Configuration'!$B$4:$O$97,14,FALSE)),0,MATCH(VLOOKUP($A34,'GPIO Configuration'!$B$4:$O$97,14,FALSE),INDIRECT($A34&\"_Func\"),0)-1)","v":0},{"$f":"IF(ISNA(VLOOKUP($A34,'GPIO Configuration'!$B$4:$P$97,15,FALSE)),0,MATCH(VLOOKUP($A34,'GPIO Configuration'!$B$4:$P$97,15,FALSE),INDIRECT($A34&\"_OutDrv\"),0)-1)","v":0}]
["P1_00",1,0,"0x0020","GPIO_PODR1_POD0","GPIO_PIDR1_PID0",{"$f":"IF(ISNA(VLOOKUP($A35,'GPIO Configuration'!$B$4:$C$97,2,FALSE)),0,1)","v":1},{"$f":"IF(ISNA(VLOOKUP($A35,'GPIO Configuration'!$B$4:$C$97,2,FALSE)),0,IF(VLOOKUP($A35,'GPIO Configuration'!$B$4:$C$97,2,FALSE)=\"是\",1,0))","v":0},{"$f":"IF(ISNA(VLOOKUP($A35,'GPIO Configuration'!$B$4:$D$97,3,FALSE)),\"\",TRIM(VLOOKUP($A35,'GPIO Configuration'!$B$4:$D$97,3,FALSE)))","v":""},{"$f":"IF(ISNA(VLOOKUP($A35,'GPIO Configuration'!$B$4:$E$97,4,FALSE)),0,IF(VLOOKUP($A35,'GPIO Configuration'!$B$4:$E$97,4,FALSE)=\"OUT - 输出\",1,0))","v":0},{"$f":"IF(ISNA(VLOOKUP($A35,'GPIO Configuration'!$B$4:$F$97,5,FALSE)),0,IF(VLOOKUP($A35,'GPIO Configuration'!$B$4:$F$97,5,FALSE)=\"1 - 高电平\",1,0))","v":0},{"$f":"IF(ISNA(VLOOKUP($A35,'GPIO Configuration'!$B$4:$K$97,10,FALSE)),0,IF(VLOOKUP($A35,'GPIO Configuration'!$B$4:$K$97,10,FALSE)=\"1 - 使能\",1,0))","v":1},{"$f":"IF(ISNA(VLOOKUP($A35,'GPIO Configuration'!$B$4:$J$97,9,FALSE)),0,MATCH(VLOOKUP($A35,'GPIO Configuration'!$B$4:$J$97,9,FALSE),INDIRECT($A35&\"_InLv\"),0)-1)","v":0},{"$f":"IF(ISNA(VLOOKUP($A35,'GPIO Configuration'!$B$4:$L$97,11,FALSE)),0,IF(VLOOKUP($A35,'GPIO Configuration'!$B$4:$L$97,11,FALSE)=\"1 - 使能\",1,0))","v":0},{"$f":"IF(ISNA(VLOOKUP($A35,'GPIO Configuration'!$B$4:$I$97,8,FALSE)),0,IF(VLOOKUP($A35,'GPIO Configuration'!$B$4:$I$97,8,FALSE)=\"上拉\",2,IF(VLOOKUP($A35,'GPIO Configuration'!$B$4:$I$97,8,FALSE)=\"下拉\",1,0)))","v":0},{"$f":"IF(ISNA(VLOOKUP($A35,'GPIO Configuration'!$B$4:$G$97,6,FALSE)),0,MATCH(VLOOKUP($A35,'GPIO Configuration'!$B$4:$G$97,6,FALSE),INDIRECT($A35&\"_Func\"),0)-1)","v":0},{"$f":"IF(ISNA(VLOOKUP($A35,'GPIO Configuration'!$B$4:$H$97,7,FALSE)),0,MATCH(VLOOKUP($A35,'GPIO Configuration'!$B$4:$H$97,7,FALSE),INDIRECT($A35&\"_OutDrv\"),0)-1)","v":3},{"$f":"IF(ISNA(VLOOKUP($A35,'GPIO Configuration'!$B$4:$M$97,12,FALSE)),0,IF(VLOOKUP($A35,'GPIO Configuration'!$B$4:$M$97,12,FALSE)=\"OUT - 输出\",1,0))","v":1},{"$f":"IF(ISNA(VLOOKUP($A35,'GPIO Configuration'!$B$4:$N$97,13,FALSE)),0,IF(VLOOKUP($A35,'GPIO Configuration'!$B$4:$N$97,13,FALSE)=\"1 - 高电平\",1,0))","v":0},{"$f":"IF(ISNA(VLOOKUP($A35,'GPIO Configuration'!$B$4:$S$97,18,FALSE)),0,IF(VLOOKUP($A35,'GPIO Configuration'!$B$4:$S$97,18,FALSE)=\"1 - 使能\",1,0))","v":1},{"$f":"IF(ISNA(VLOOKUP($A35,'GPIO Configuration'!$B$4:$R$97,17,FALSE)),0,MATCH(VLOOKUP($A35,'GPIO Configuration'!$B$4:$R$97,17,FALSE),INDIRECT($A35&\"_InLv\"),0)-1)","v":0},{"$f":"IF(ISNA(VLOOKUP($A35,'GPIO Configuration'!$B$4:$T$97,19,FALSE)),0,IF(VLOOKUP($A35,'GPIO Configuration'!$B$4:$T$97,19,FALSE)=\"1 - 使能\",1,0))","v":0},{"$f":"IF(ISNA(VLOOKUP($A35,'GPIO Configuration'!$B$4:$Q$97,16,FALSE)),0,IF(VLOOKUP($A35,'GPIO Configuration'!$B$4:$Q$97,16,FALSE)=\"上拉\",2,IF(VLOOKUP($A35,'GPIO Configuration'!$B$4:$Q$97,16,FALSE)=\"下拉\",1,0)))","v":0},{"$f":"IF(ISNA(VLOOKUP($A35,'GPIO Configuration'!$B$4:$O$97,14,FALSE)),0,MATCH(VLOOKUP($A35,'GPIO Configuration'!$B$4:$O$97,14,FALSE),INDIRECT($A35&\"_Func\"),0)-1)","v":0},{"$f":"IF(ISNA(VLOOKUP($A35,'GPIO Configuration'!$B$4:$P$97,15,FALSE)),0,MATCH(VLOOKUP($A35,'GPIO Configuration'!$B$4:$P$97,15,FALSE),INDIRECT($A35&\"_OutDrv\"),0)-1)","v":0}]
["P1_01",1,1,"0x0021","GPIO_PODR1_POD1","GPIO_PIDR1_PID1",{"$f":"IF(ISNA(VLOOKUP($A36,'GPIO Configuration'!$B$4:$C$97,2,FALSE)),0,1)","v":1},{"$f":"IF(ISNA(VLOOKUP($A36,'GPIO Configuration'!$B$4:$C$97,2,FALSE)),0,IF(VLOOKUP($A36,'GPIO Configuration'!$B$4:$C$97,2,FALSE)=\"是\",1,0))","v":0},{"$f":"IF(ISNA(VLOOKUP($A36,'GPIO Configuration'!$B$4:$D$97,3,FALSE)),\"\",TRIM(VLOOKUP($A36,'GPIO Configuration'!$B$4:$D$97,3,FALSE)))","v":""},{"$f":"IF(ISNA(VLOOKUP($A36,'GPIO Configuration'!$B$4:$E$97,4,FALSE)),0,IF(VLOOKUP($A36,'GPIO Configuration'!$B$4:$E$97,4,FALSE)=\"OUT - 输出\",1,0))","v":0},{"$f":"IF(ISNA(VLOOKUP($A36,'GPIO Configuration'!$B$4:$F$97,5,FALSE)),0,IF(VLOOKUP($A36,'GPIO Configuration'!$B$4:$F$97,5,FALSE)=\"1 - 高电平\",1,0))","v":0},{"$f":"IF(ISNA(VLOOKUP($A36,'GPIO Configuration'!$B$4:$K$97,10,FALSE)),0,IF(VLOOKUP($A36,'GPIO Configuration'!$B$4:$K$97,10,FALSE)=\"1 - 使能\",1,0))","v":1},{"$f":"IF(ISNA(VLOOKUP($A36,'GPIO Configuration'!$B$4:$J$97,9,FALSE)),0,MATCH(VLOOKUP($A36,'GPIO Configuration'!$B$4:$J$97,9,FALSE),INDIRECT($A36&\"_InLv\"),0)-1)","v":0},{"$f":"IF(ISNA(VLOOKUP($A36,'GPIO Configuration'!$B$4:$L$97,11,FALSE)),0,IF(VLOOKUP($A36,'GPIO Configuration'!$B$4:$L$97,11,FALSE)=\"1 - 使能\",1,0))","v":0},{"$f":"IF(ISNA(VLOOKUP($A36,'GPIO Configuration'!$B$4:$I$97,8,FALSE)),0,IF(VLOOKUP($A36,'GPIO Configuration'!$B$4:$I$97,8,FALSE)=\"上拉\",2,IF(VLOOKUP($A36,'GPIO Configuration'!$B$4:$I$97,8,FALSE)=\"下拉\",1,0)))","v":0},{"$f":"IF(ISNA(VLOOKUP($A36,'GPIO Configuration'!$B$4:$G$97,6,FALSE)),0,MATCH(VLOOKUP($A36,'GPIO Configuration'!$B$4:$G$97,6,FALSE),INDIRECT($A36&\"_Func\"),0)-1)","v":0},{"$f":"IF(ISNA(VLOOKUP($A36,'GPIO Configuration'!$B$4:$H$97,7,FALSE)),0,MATCH(VLOOKUP($A36,'GPIO Configuration'!$B$4:$H$97,7,FALSE),INDIRECT($A36&\"_OutDrv\"),0)-1)","v":3},{"$f":"IF(ISNA(VLOOKUP($A36,'GPIO Configuration'!$B$4:$M$97,12,FALSE)),0,IF(VLOOKUP($A36,'GPIO Configuration'!$B$4:$M$97,12,FALSE)=\"OUT - 输出\",1,0))","v":1},{"$f":"IF(ISNA(VLOOKUP($A36,'GPIO Configuration'!$B$4:$N$97,13,FALSE)),0,IF(VLOOKUP($A36,'GPIO Configuration'!$B$4:$N$97,13,FALSE)=\"1 - 高电平\",1,0))","v":0},{"$f":"IF(ISNA(VLOOKUP($A36,'GPIO Configuration'!$B$4:$S$97,18,FALSE)),0,IF(VLOOKUP($A36,'GPIO Configuration'!$B$4:$S$97,18,FALSE)=\"1 - 使能\",1,0))","v":0},{"$f":"IF(ISNA(VLOOKUP($A36,'GPIO Configuration'!$B$4:$R$97,17,FALSE)),0,MATCH(VLOOKUP($A36,'GPIO Configuration'!$B$4:$R$97,17,FALSE),INDIRECT($A36&\"_InLv\"),0)-1)","v":0},{"$f":"IF(ISNA(VLOOKUP($A36,'GPIO Configuration'!$B$4:$T$97,19,FALSE)),0,IF(VLOOKUP($A36,'GPIO Configuration'!$B$4:$T$97,19,FALSE)=\"1 - 使能\",1,0))","v":1},{"$f":"IF(ISNA(VLOOKUP($A36,'GPIO Configuration'!$B$4:$Q$97,16,FALSE)),0,IF(VLOOKUP($A36,'GPIO Configuration'!$B$4:$Q$97,16,FALSE)=\"上拉\",2,IF(VLOOKUP($A36,'GPIO Configuration'!$B$4:$Q$97,16,FALSE)=\"下拉\",1,0)))","v":0},{"$f":"IF(ISNA(VLOOKUP($A36,'GPIO Configuration'!$B$4:$O$97,14,FALSE)),0,MATCH(VLOOKUP($A36,'GPIO Configuration'!$B$4:$O$97,14,FALSE),INDIRECT($A36&\"_Func\"),0)-1)","v":0},{"$f":"IF(ISNA(VLOOKUP($A36,'GPIO Configuration'!$B$4:$P$97,15,FALSE)),0,MATCH(VLOOKUP($A36,'GPIO Configuration'!$B$4:$P$97,15,FALSE),INDIRECT($A36&\"_OutDrv\"),0)-1)","v":0}]
["P1_02",1,2,"0x0022","GPIO_PODR1_POD2","GPIO_PIDR1_PID2",{"$f":"IF(ISNA(VLOOKUP($A37,'GPIO Configuration'!$B$4:$C$97,2,FALSE)),0,1)","v":1},{"$f":"IF(ISNA(VLOOKUP($A37,'GPIO Configuration'!$B$4:$C$97,2,FALSE)),0,IF(VLOOKUP($A37,'GPIO Configuration'!$B$4:$C$97,2,FALSE)=\"是\",1,0))","v":1},{"$f":"IF(ISNA(VLOOKUP($A37,'GPIO Configuration'!$B$4:$D$97,3,FALSE)),\"\",TRIM(VLOOKUP($A37,'GPIO Configuration'!$B$4:$D$97,3,FALSE)))","v":"Line_In_SOC_CC"},{"$f":"IF(ISNA(VLOOKUP($A37,'GPIO Configuration'!$B$4:$E$97,4,FALSE)),0,IF(VLOOKUP($A37,'GPIO Configuration'!$B$4:$E$97,4,FALSE)=\"OUT - 输出\",1,0))","v":0},{"$f":"IF(ISNA(VLOOKUP($A37,'GPIO Configuration'!$B$4:$F$97,5,FALSE)),0,IF(VLOOKUP($A37,'GPIO Configuration'!$B$4:$F$97,5,FALSE)=\"1 - 高电平\",1,0))","v":0},{"$f":"IF(ISNA(VLOOKUP($A37,'GPIO Configuration'!$B$4:$K$97,10,FALSE)),0,IF(VLOOKUP($A37,'GPIO Configuration'!$B$4:$K$97,10,FALSE)=\"1 - 使能\",1,0))","v":1},{"$f":"IF(ISNA(VLOOKUP($A37,'GPIO Configuration'!$B$4:$J$97,9,FALSE)),0,MATCH(VLOOKUP($A37,'GPIO Configuration'!$B$4:$J$97,9,FALSE),INDIRECT($A37&\"_InLv\"),0)-1)","v":0},{"$f":"IF(ISNA(VLOOKUP($A37,'GPIO Configuration'!$B$4:$L$97,11,FALSE)),0,IF(VLOOKUP($A37,'GPIO Configuration'!$B$4:$L$97,11,FALSE)=\"1 - 使能\",1,0))","v":1},{"$f":"IF(ISNA(VLOOKUP($A37,'GPIO Configuration'!$B$4:$I$97,8,FALSE)),0,IF(VLOOKUP($A37,'GPIO Configuration'!$B$4:$I$97,8,FALSE)=\"上拉\",2,IF(VLOOKUP($A37,'GPIO Configuration'!$B$4:$I$97,8,FALSE)=\"下拉\",1,0)))","v":0},{"$f":"IF(ISNA(VLOOKUP($A37,'GPIO Configuration'!$B$4:$G$97,6,FALSE)),0,MATCH(VLOOKUP($A37,'GPIO Configuration'!$B$4:$G$97,6,FALSE),INDIRECT($A37&\"_Func\"),0)-1)","v":0},{"$f":"IF(ISNA(VLOOKUP($A37,'GPIO Configuration'!$B$4:$H$97,7,FALSE)),0,MATCH(VLOOKUP($A37,'GPIO Configuration'!$B$4:$H$97,7,FALSE),INDIRECT($A37&\"_OutDrv\"),0)-1)","v":3},{"$f":"IF(ISNA(VLOOKUP($A37,'GPIO Configuration'!$B$4:$M$97,12,FALSE)),0,IF(VLOOKUP($A37,'GPIO Configuration'!$B$4:$M$97,12,FALSE)=\"OUT - 输出\",1,0))","v":0},{"$f":"IF(ISNA(VLOOKUP($A37,'GPIO Configuration'!$B$4:$N$97,13,FALSE)),0,IF(VLOOKUP($A37,'GPIO Configuration'!$B$4:$N$97,13,FALSE)=\"1 - 高电平\",1,0))","v":0},{"$f":"IF(ISNA(VLOOKUP($A37,'GPIO Configuration'!$B$4:$S$97,18,FALSE)),0,IF(VLOOKUP($A37,'GPIO Configuration'!$B$4:$S$97,18,FALSE)=\"1 - 使能\",1,0))","v":1},{"$f":"IF(ISNA(VLOOKUP($A37,'GPIO Configuration'!$B$4:$R$97,17,FALSE)),0,MATCH(VLOOKUP($A37,'GPIO Configuration'!$B$4:$R$97,17,FALSE),INDIRECT($A37&\"_InLv\"),0)-1)","v":0},{"$f":"IF(ISNA(VLOOKUP($A37,'GPIO Configuration'!$B$4:$T$97,19,FALSE)),0,IF(VLOOKUP($A37,'GPIO Configuration'!$B$4:$T$97,19,FALSE)=\"1 - 使能\",1,0))","v":1},{"$f":"IF(ISNA(VLOOKUP($A37,'GPIO Configuration'!$B$4:$Q$97,16,FALSE)),0,IF(VLOOKUP($A37,'GPIO Configuration'!$B$4:$Q$97,16,FALSE)=\"上拉\",2,IF(VLOOKUP($A37,'GPIO Configuration'!$B$4:$Q$97,16,FALSE)=\"下拉\",1,0)))","v":0},{"$f":"IF(ISNA(VLOOKUP($A37,'GPIO Configuration'!$B$4:$O$97,14,FALSE)),0,MATCH(VLOOKUP($A37,'GPIO Configuration'!$B$4:$O$97,14,FALSE),INDIRECT($A37&\"_Func\"),0)-1)","v":0},{"$f":"IF(ISNA(VLOOKUP($A37,'GPIO Configuration'!$B$4:$P$97,15,FALSE)),0,MATCH(VLOOKUP($A37,'GPIO Configuration'!$B$4:$P$97,15,FALSE),INDIRECT($A37&\"_OutDrv\"),0)-1)","v":0}]
["P1_03",1,3,"0x0023","GPIO_PODR1_POD3","GPIO_PIDR1_PID3",{"$f":"IF(ISNA(VLOOKUP($A38,'GPIO Configuration'!$B$4:$C$97,2,FALSE)),0,1)","v":1},{"$f":"IF(ISNA(VLOOKUP($A38,'GPIO Configuration'!$B$4:$C$97,2,FALSE)),0,IF(VLOOKUP($A38,'GPIO Configuration'!$B$4:$C$97,2,FALSE)=\"是\",1,0))","v":0},{"$f":"IF(ISNA(VLOOKUP($A38,'GPIO Configuration'!$B$4:$D$97,3,FALSE)),\"\",TRIM(VLOOKUP($A38,'GPIO Configuration'!$B$4:$D$97,3,FALSE)))","v":"NTC_IN"},{"$f":"IF(ISNA(VLOOKUP($A38,'GPIO Configuration'!$B$4:$E$97,4,FALSE)),0,IF(VLOOKUP($A38,'GPIO Configuration'!$B$4:$E$97,4,FALSE)=\"OUT - 输出\",1,0))","v":0},{"$f":"IF(ISNA(VLOOKUP($A38,'GPIO Configuration'!$B$4:$F$97,5,FALSE)),0,IF(VLOOKUP($A38,'GPIO Configuration'!$B$4:$F$97,5,FALSE)=\"1 - 高电平\",1,0))","v":0},{"$f":"IF(ISNA(VLOOKUP($A38,'GPIO Configuration'!$B$4:$K$97,10,FALSE)),0,IF(VLOOKUP($A38,'GPIO Configuration'!$B$4:$K$97,10,FALSE)=\"1 - 使能\",1,0))","v":1},{"$f":"IF(ISNA(VLOOKUP($A38,'GPIO Configuration'!$B$4:$J$97,9,FALSE)),0,MATCH(VLOOKUP($A38,'GPIO Configuration'!$B$4:$J$97,9,FALSE),INDIRECT($A38&\"_InLv\"),0)-1)","v":0},{"$f":"IF(ISNA(VLOOKUP($A38,'GPIO Configuration'!$B$4:$L$97,11,FALSE)),0,IF(VLOOKUP($A38,'GPIO Configuration'!$B$4:$L$97,11,FALSE)=\"1 - 使能\",1,0))","v":0},{"$f":"IF(ISNA(VLOOKUP($A38,'GPIO Configuration'!$B$4:$I$97,8,FALSE)),0,IF(VLOOKUP($A38,'GPIO Configuration'!$B$4:$I$97,8,FALSE)=\"上拉\",2,IF(VLOOKUP($A38,'GPIO Configuration'!$B$4:$I$97,8,FALSE)=\"下拉\",1,0)))","v":0},{"$f":"IF(ISNA(VLOOKUP($A38,'GPIO Configuration'!$B$4:$G$97,6,FALSE)),0,MATCH(VLOOKUP($A38,'GPIO Configuration'!$B$4:$G$97,6,FALSE),INDIRECT($A38&\"_Func\"),0)-1)","v":0},{"$f":"IF(ISNA(VLOOKUP($A38,'GPIO Configuration'!$B$4:$H$97,7,FALSE)),0,MATCH(VLOOKUP($A38,'GPIO Configuration'!$B$4:$H$97,7,FALSE),INDIRECT($A38&\"_OutDrv\"),0)-1)","v":3},{"$f":"IF(ISNA(VLOOKUP($A38,'GPIO Configuration'!$B$4:$M$97,12,FALSE)),0,IF(VLOOKUP($A38,'GPIO Configuration'!$B$4:$M$97,12,FALSE)=\"OUT - 输出\",1,0))","v":0},{"$f":"IF(ISNA(VLOOKUP($A38,'GPIO Configuration'!$B$4:$N$97,13,FALSE)),0,IF(VLOOKUP($A38,'GPIO Configuration'!$B$4:$N$97,13,FALSE)=\"1 - 高电平\",1,0))","v":0},{"$f":"IF(ISNA(VLOOKUP($A38,'GPIO Configuration'!$B$4:$S$97,18,FALSE)),0,IF(VLOOKUP($A38,'GPIO Configuration'!$B$4:$S$97,18,FALSE)=\"1 - 使能\",1,0))","v":0},{"$f":"IF(ISNA(VLOOKUP($A38,'GPIO Configuration'!$B$4:$R$97,17,FALSE)),0,MATCH(VLOOKUP($A38,'GPIO Configuration'!$B$4:$R$97,17,FALSE),INDIRECT($A38&\"_InLv\"),0)-1)","v":0},{"$f":"IF(ISNA(VLOOKUP($A38,'GPIO Configuration'!$B$4:$T$97,19,FALSE)),0,IF(VLOOKUP($A38,'GPIO Configuration'!$B$4:$T$97,19,FALSE)=\"1 - 使能\",1,0))","v":1},{"$f":"IF(ISNA(VLOOKUP($A38,'GPIO Configuration'!$B$4:$Q$97,16,FALSE)),0,IF(VLOOKUP($A38,'GPIO Configuration'!$B$4:$Q$97,16,FALSE)=\"上拉\",2,IF(VLOOKUP($A38,'GPIO Configuration'!$B$4:$Q$97,16,FALSE)=\"下拉\",1,0)))","v":0},{"$f":"IF(ISNA(VLOOKUP($A38,'GPIO Configuration'!$B$4:$O$97,14,FALSE)),0,MATCH(VLOOKUP($A38,'GPIO Configuration'!$B$4:$O$97,14,FALSE),INDIRECT($A38&\"_Func\"),0)-1)","v":0},{"$f":"IF(ISNA(VLOOKUP($A38,'GPIO Configuration'!$B$4:$P$97,15,FALSE)),0,MATCH(VLOOKUP($A38,'GPIO Configuration'!$B$4:$P$97,15,FALSE),INDIRECT($A38&\"_OutDrv\"),0)-1)","v":0}]
["P1_04",1,4,"0x0024","GPIO_PODR1_POD4","GPIO_PIDR1_PID4",{"$f":"IF(ISNA(VLOOKUP($A39,'GPIO Configuration'!$B$4:$C$97,2,FALSE)),0,1)","v":1},{"$f":"IF(ISNA(VLOOKUP($A39,'GPIO Configuration'!$B$4:$C$97,2,FALSE)),0,IF(VLOOKUP($A39,'GPIO Configuration'!$B$4:$C$97,2,FALSE)=\"是\",1,0))","v":1},{"$f":"IF(ISNA(VLOOKUP($A39,'GPIO Configuration'!$B$4:$D$97,3,FALSE)),\"\",TRIM(VLOOKUP($A39,'GPIO Configuration'!$B$4:$D$97,3,FALSE)))","v":"LED_DRIVER_EN"},{"$f":"IF(ISNA(VLOOKUP($A39,'GPIO Configuration'!$B$4:$E$97,4,FALSE)),0,IF(VLOOKUP($A39,'GPIO Configuration'!$B$4:$E$97,4,FALSE)=\"OUT - 输出\",1,0))","v":1},{"$f":"IF(ISNA(VLOOKUP($A39,'GPIO Configuration'!$B$4:$F$97,5,FALSE)),0,IF(VLOOKUP($A39,'GPIO Configuration'!$B$4:$F$97,5,FALSE)=\"1 - 高电平\",1,0))","v":0},{"$f":"IF(ISNA(VLOOKUP($A39,'GPIO Configuration'!$B$4:$K$97,10,FALSE)),0,IF(VLOOKUP($A39,'GPIO Configuration'!$B$4:$K$97,10,FALSE)=\"1 - 使能\",1,0))","v":0},{"$f":"IF(ISNA(VLOOKUP($A39,'GPIO Configuration'!$B$4:$J$97,9,FALSE)),0,MATCH(VLOOKUP($A39,'GPIO Configuration'!$B$4:$J$97,9,FALSE),INDIRECT($A39&\"_InLv\"),0)-1)","v":0},{"$f":"IF(ISNA(VLOOKUP($A39,'GPIO Configuration'!$B$4:$L$97,11,FALSE)),0,IF(VLOOKUP($A39,'GPIO Configuration'!$B$4:$L$97,11,FALSE)=\"1 - 使能\",1,0))","v":1},{"$f":"IF(ISNA(VLOOKUP($A39,'GPIO Configuration'!$B$4:$I$97,8,FALSE)),0,IF(VLOOKUP($A39,'GPIO Configuration'!$B$4:$I$97,8,FALSE)=\"上拉\",2,IF(VLOOKUP($A39,'GPIO Configuration'!$B$4:$I$97,8,FALSE)=\"下拉\",1,0)))","v":0},{"$f":"IF(ISNA(VLOOKUP($A39,'GPIO Configuration'!$B$4:$G$97,6,FALSE)),0,MATCH(VLOOKUP($A39,'GPIO Configuration'!$B$4:$G$97,6,FALSE),INDIRECT($A39&\"_Func\"),0)-1)","v":0},{"$f":"IF(ISNA(VLOOKUP($A39,'GPIO Configuration'!$B$4:$H$97,7,FALSE)),0,MATCH(VLOOKUP($A39,'GPIO Configuration'!$B$4:$H$97,7,FALSE),INDIRECT($A39&\"_OutDrv\"),0)-1)","v":3},{"$f":"IF(ISNA(VLOOKUP($A39,'GPIO Configuration'!$B$4:$M$97,12,FALSE)),0,IF(VLOOKUP($A39,'GPIO Configuration'!$B$4:$M$97,12,FALSE)=\"OUT - 输出\",1,0))","v":0},{"$f":"IF(ISNA(VLOOKUP($A39,'GPIO Configuration'!$B$4:$N$97,13,FALSE)),0,IF(VLOOKUP($A39,'GPIO Configuration'!$B$4:$N$97,13,FALSE)=\"1 - 高电平\",1,0))","v":0},{"$f":"IF(ISNA(VLOOKUP($A39,'GPIO Configuration'!$B$4:$S$97,18,FALSE)),0,IF(VLOOKUP($A39,'GPIO Configuration'!$B$4:$S$97,18,FALSE)=\"1 - 使能\",1,0))","v":1},{"$f":"IF(ISNA(VLOOKUP($A39,'GPIO Configuration'!$B$4:$R$97,17,FALSE)),0,MATCH(VLOOKUP($A39,'GPIO Configuration'!$B$4:$R$97,17,FALSE),INDIRECT($A39&\"_InLv\"),0)-1)","v":0},{"$f":"IF(ISNA(VLOOKUP($A39,'GPIO Configuration'!$B$4:$T$97,19,FALSE)),0,IF(VLOOKUP($A39,'GPIO Configuration'!$B$4:$T$97,19,FALSE)=\"1 - 使能\",1,0))","v":1},{"$f":"IF(ISNA(VLOOKUP($A39,'GPIO Configuration'!$B$4:$Q$97,16,FALSE)),0,IF(VLOOKUP($A39,'GPIO Configuration'!$B$4:$Q$97,16,FALSE)=\"上拉\",2,IF(VLOOKUP($A39,'GPIO Configuration'!$B$4:$Q$97,16,FALSE)=\"下拉\",1,0)))","v":0},{"$f":"IF(ISNA(VLOOKUP($A39,'GPIO Configuration'!$B$4:$O$97,14,FALSE)),0,MATCH(VLOOKUP($A39,'GPIO Configuration'!$B$4:$O$97,14,FALSE),INDIRECT($A39&\"_Func\"),0)-1)","v":0},{"$f":"IF(ISNA(VLOOKUP($A39,'GPIO Configuration'!$B$4:$P$97,15,FALSE)),0,MATCH(VLOOKUP($A39,'GPIO Configuration'!$B$4:$P$97,15,FALSE),INDIRECT($A39&\"_OutDrv\"),0)-1)","v":0}]
["P1_05",1,5,"0x0025","GPIO_PODR1_POD5","GPIO_PIDR1_PID5",{"$f":"IF(ISNA(VLOOKUP($A40,'GPIO Configuration'!$B$4:$C$97,2,FALSE)),0,1)","v":1},{"$f":"IF(ISNA(VLOOKUP($A40,'GPIO Configuration'!$B$4:$C$97,2,FALSE)),0,IF(VLOOKUP($A40,'GPIO Configuration'!$B$4:$C$97,2,FALSE)=\"是\",1,0))","v":1},{"$f":"IF(ISNA(VLOOKUP($A40,'GPIO Configuration'!$B$4:$D$97,3,FALSE)),\"\",TRIM(VLOOKUP($A40,'GPIO Configuration'!$B$4:$D$97,3,FALSE)))","v":"SDA_LED_DRIVER"},{"$f":"IF(ISNA(VLOOKUP($A40,'GPIO Configuration'!$B$4:$E$97,4,FALSE)),0,IF(VLOOKUP($A40,'GPIO Configuration'!$B$4:$E$97,4,FALSE)=\"OUT - 输出\",1,0))","v":1},{"$f":"IF(ISNA(VLOOKUP($A40,'GPIO Configuration'!$B$4:$F$97,5,FALSE)),0,IF(VLOOKUP($A40,'GPIO Configuration'!$B$4:$F$97,5,FALSE)=\"1 - 高电平\",1,0))","v":0},{"$f":"IF(ISNA(VLOOKUP($A40,'GPIO Configuration'!$B$4:$K$97,10,FALSE)),0,IF(VLOOKUP($A40,'GPIO Configuration'!$B$4:$K$97,10,FALSE)=\"1 - 使能\",1,0))","v":1},{"$f":"IF(ISNA(VLOOKUP($A40,'GPIO Configuration'!$B$4:$J$97,9,FALSE)),0,MATCH(VLOOKUP($A40,'GPIO Configuration'!$B$4:$J$97,9,FALSE),INDIRECT($A40&\"_InLv\"),0)-1)","v":0},{"$f":"IF(ISNA(VLOOKUP($A40,'GPIO Configuration'!$B$4:$L$97,11,FALSE)),0,IF(VLOOKUP($A40,'GPIO Configuration'!$B$4:$L$97,11,FALSE)=\"1 - 使能\",1,0))","v":1},{"$f":"IF(ISNA(VLOOKUP($A40,'GPIO Configuration'!$B$4:$I$97,8,FALSE)),0,IF(VLOOKUP($A40,'GPIO Configuration'!$B$4:$I$97,8,FALSE)=\"上拉\",2,IF(VLOOKUP($A40,'GPIO Configuration'!$B$4:$I$97,8,FALSE)=\"下拉\",1,0)))","v":0},{"$f":"IF(ISNA(VLOOKUP($A40,'GPIO Configuration'!$B$4:$G$97,6,FALSE)),0,MATCH(VLOOKUP($A40,'GPIO Configuration'!$B$4:$G$97,6,FALSE),INDIRECT($A40&\"_Func\"),0)-1)","v":0},{"$f":"IF(ISNA(VLOOKUP($A40,'GPIO Configuration'!$B$4:$H$97,7,FALSE)),0,MATCH(VLOOKUP($A40,'GPIO Configuration'!$B$4:$H$97,7,FALSE),INDIRECT($A40&\"_OutDrv\"),0)-1)","v":3},{"$f":"IF(ISNA(VLOOKUP($A40,'GPIO Configuration'!$B$4:$M$97,12,FALSE)),0,IF(VLOOKUP($A40,'GPIO Configuration'!$B$4:$M$97,12,FALSE)=\"OUT - 输出\",1,0))","v":1},{"$f":"IF(ISNA(VLOOKUP($A40,'GPIO Configuration'!$B$4:$N$97,13,FALSE)),0,IF(VLOOKUP($A40,'GPIO Configuration'!$B$4:$N$97,13,FALSE)=\"1 - 高电平\",1,0))","v":1},{"$f":"IF(ISNA(VLOOKUP($A40,'GPIO Configuration'!$B$4:$S$97,18,FALSE)),0,IF(VLOOKUP($A40,'GPIO Configuration'!$B$4:$S$97,18,FALSE)=\"1 - 使能\",1,0))","v":0},{"$f":"IF(ISNA(VLOOKUP($A40,'GPIO Configuration'!$B$4:$R$97,17,FALSE)),0,MATCH(VLOOKUP($A40,'GPIO Configuration'!$B$4:$R$97,17,FALSE),INDIRECT($A40&\"_InLv\"),0)-1)","v":0},{"$f":"IF(ISNA(VLOOKUP($A40,'GPIO Configuration'!$B$4:$T$97,19,FALSE)),0,IF(VLOOKUP($A40,'GPIO Configuration'!$B$4:$T$97,19,FALSE)=\"1 - 使能\",1,0))","v":1},{"$f":"IF(ISNA(VLOOKUP($A40,'GPIO Configuration'!$B$4:$Q$97,16,FALSE)),0,IF(VLOOKUP($A40,'GPIO Configuration'!$B$4:$Q$97,16,FALSE)=\"上拉\",2,IF(VLOOKUP($A40,'GPIO Configuration'!$B$4:$Q$97,16,FALSE)=\"下拉\",1,0)))","v":0},{"$f":"IF(ISNA(VLOOKUP($A40,'GPIO Configuration'!$B$4:$O$97,14,FALSE)),0,MATCH(VLOOKUP($A40,'GPIO Configuration'!$B$4:$O$97,14,FALSE),INDIRECT($A40&\"_Func\"),0)-1)","v":0},{"$f":"IF(ISNA(VLOOKUP($A40,'GPIO Configuration'!$B$4:$P$97,15,FALSE)),0,MATCH(VLOOKUP($A40,'GPIO Configuration'!$B$4:$P$97,15,FALSE),INDIRECT($A40&\"_OutDrv\"),0)-1)","v":0}]
["P1_06",1,6,"0x0026","GPIO_PODR1_POD6","GPIO_PIDR1_PID6",{"$f":"IF(ISNA(VLOOKUP($A41,'GPIO Configuration'!$B$4:$C$97,2,FALSE)),0,1)","v":1},{"$f":"IF(ISNA(VLOOKUP($A41,'GPIO Configuration'!$B$4:$C$97,2,FALSE)),0,IF(VLOOKUP($A41,'GPIO Configuration'!$B$4:$C$97,2,FALSE)=\"是\",1,0))","v":1},{"$f":"IF(ISNA(VLOOKUP($A41,'GPIO Configuration'!$B$4:$D$97,3,FALSE)),\"\",TRIM(VLOOKUP($A41,'GPIO Configuration'!$B$4:$D$97,3,FALSE)))","v":"SCL_LED_DRIVER"},{"$f":"IF(ISNA(VLOOKUP($A41,'GPIO Configuration'!$B$4:$E$97,4,FALSE)),0,IF(VLOOKUP($A41,'GPIO Configuration'!$B$4:$E$97,4,FALSE)=\"OUT - 输出\",1,0))","v":1},{"$f":"IF(ISNA(VLOOKUP($A41,'GPIO Configuration'!$B$4:$F$97,5,FALSE)),0,IF(VLOOKUP($A41,'GPIO Configuration'!$B$4:$F$97,5,FALSE)=\"1 - 高电平\",1,0))","v":0},{"$f":"IF(ISNA(VLOOKUP($A41,'GPIO Configuration'!$B$4:$K$97,10,FALSE)),0,IF(VLOOKUP($A41,'GPIO Configuration'!$B$4:$K$97,10,FALSE)=\"1 - 使能\",1,0))","v":0},{"$f":"IF(ISNA(VLOOKUP($A41,'GPIO Configuration'!$B$4:$J$97,9,FALSE)),0,MATCH(VLOOKUP($A41,'GPIO Configuration'!$B$4:$J$97,9,FALSE),INDIRECT($A41&\"_InLv\"),0)-1)","v":0},{"$f":"IF(ISNA(VLOOKUP($A41,'GPIO Configuration'!$B$4:$L$97,11,FALSE)),0,IF(VLOOKUP($A41,'GPIO Configuration'!$B$4:$L$97,11,FALSE)=\"1 - 使能\",1,0))","v":1},{"$f":"IF(ISNA(VLOOKUP($A41,'GPIO Configuration'!$B$4:$I$97,8,FALSE)),0,IF(VLOOKUP($A41,'GPIO Configuration'!$B$4:$I$97,8,FALSE)=\"上拉\",2,IF(VLOOKUP($A41,'GPIO Configuration'!$B$4:$I$97,8,FALSE)=\"下拉\",1,0)))","v":0},{"$f":"IF(ISNA(VLOOKUP($A41,'GPIO Configuration'!$B$4:$G$97,6,FALSE)),0,MATCH(VLOOKUP($A41,'GPIO Configuration'!$B$4:$G$97,6,FALSE),INDIRECT($A41&\"_Func\"),0)-1)","v":0},{"$f":"IF(ISNA(VLOOKUP($A41,'GPIO Configuration'!$B$4:$H$97,7,FALSE)),0,MATCH(VLOOKUP($A41,'GPIO Configuration'!$B$4:$H$97,7,FALSE),INDIRECT($A41&\"_OutDrv\"),0)-1)","v":3},{"$f":"IF(ISNA(VLOOKUP($A41,'GPIO Configuration'!$B$4:$M$97,12,FALSE)),0,IF(VLOOKUP($A41,'GPIO Configuration'!$B$4:$M$97,12,FALSE)=\"OUT - 输出\",1,0))","v":1},{"$f":"IF(ISNA(VLOOKUP($A41,'GPIO Configuration'!$B$4:$N$97,13,FALSE)),0,IF(VLOOKUP($A41,'GPIO Configuration'!$B$4:$N$97,13,FALSE)=\"1 - 高电平\",1,0))","v":1},{"$f":"IF(ISNA(VLOOKUP($A41,'GPIO Configuration'!$B$4:$S$97,18,FALSE)),0,IF(VLOOKUP($A41,'GPIO Configuration'!$B$4:$S$97,18,FALSE)=\"1 - 使能\",1,0))","v":1},{"$f":"IF(ISNA(VLOOKUP($A41,'GPIO Configuration'!$B$4:$R$97,17,FALSE)),0,MATCH(VLOOKUP($A41,'GPIO Configuration'!$B$4:$R$97,17,FALSE),INDIRECT($A41&\"_InLv\"),0)-1)","v":0},{"$f":"IF(ISNA(VLOOKUP($A41,'GPIO Configuration'!$B$4:$T$97,19,FALSE)),0,IF(VLOOKUP($A41,'GPIO Configuration'!$B$4:$T$97,19,FALSE)=\"1 - 使能\",1,0))","v":1},{"$f":"IF(ISNA(VLOOKUP($A41,'GPIO Configuration'!$B$4:$Q$97,16,FALSE)),0,IF(VLOOKUP($A41,'GPIO Configuration'!$B$4:$Q$97,16,FALSE)=\"上拉\",2,IF(VLOOKUP($A41,'GPIO Configuration'!$B$4:$Q$97,16,FALSE)=\"下拉\",1,0)))","v":0},{"$f":"IF(ISNA(VLOOKUP($A41,'GPIO Configuration'!$B$4:$O$97,14,FALSE)),0,MATCH(VLOOKUP($A41,'GPIO Configuration'!$B$4:$O$97,14,FALSE),INDIRECT($A41&\"_Func\"),0)-1)","v":0},{"$f":"IF(ISNA(VLOOKUP($A41,'GPIO Configuration'!$B$4:$P$97,15,FALSE)),0,MATCH(VLOOKUP($A41,'GPIO Configuration'!$B$4:$P$97,15,FALSE),INDIRECT($A41&\"_OutDrv\"),0)-1)","v":0}]
["P1_07",1,7,"0x0027","GPIO_PODR1_POD7","GPIO_PIDR1_PID7",{"$f":"IF(ISNA(VLOOKUP($A42,'GPIO Configuration'!$B$4:$C$97,2,FALSE)),0,1)","v":1},{"$f":"IF(ISNA(VLOOKUP($A42,'GPIO Configuration'!$B$4:$C$97,2,FALSE)),0,IF(VLOOKUP($A42,'GPIO Configuration'!$B$4:$C$97,2,FALSE)=\"是\",1,0))","v":1},{"$f":"IF(ISNA(VLOOKUP($A42,'GPIO Configuration'!$B$4:$D$97,3,FALSE)),\"\",TRIM(VLOOKUP($A42,'GPIO Configuration'!$B$4:$D$97,3,FALSE)))","v":"Line_In_DoorOpen"},{"$f":"IF(ISNA(VLOOKUP($A42,'GPIO Configuration'!$B$4:$E$97,4,FALSE)),0,IF(VLOOKUP($A42,'GPIO Configuration'!$B$4:$E$97,4,FALSE)=\"OUT - 输出\",1,0))","v":0},{"$f":"IF(ISNA(VLOOKUP($A42,'GPIO Configuration'!$B$4:$F$97,5,FALSE)),0,IF(VLOOKUP($A42,'GPIO Configuration'!$B$4:$F$97,5,FALSE)=\"1 - 高电平\",1,0))","v":0},{"$f":"IF(ISNA(VLOOKUP($A42,'GPIO Configuration'!$B$4:$K$97,10,FALSE)),0,IF(VLOOKUP($A42,'GPIO Configuration'!$B$4:$K$97,10,FALSE)=\"1 - 使能\",1,0))","v":1},{"$f":"IF(ISNA(VLOOKUP($A42,'GPIO Configuration'!$B$4:$J$97,9,FALSE)),0,MATCH(VLOOKUP($A42,'GPIO Configuration'!$B$4:$J$97,9,FALSE),INDIRECT($A42&\"_InLv\"),0)-1)","v":0},{"$f":"IF(ISNA(VLOOKUP($A42,'GPIO Configuration'!$B$4:$L$97,11,FALSE)),0,IF(VLOOKUP($A42,'GPIO Configuration'!$B$4:$L$97,11,FALSE)=\"1 - 使能\",1,0))","v":1},{"$f":"IF(ISNA(VLOOKUP($A42,'GPIO Configuration'!$B$4:$I$97,8,FALSE)),0,IF(VLOOKUP($A42,'GPIO Configuration'!$B$4:$I$97,8,FALSE)=\"上拉\",2,IF(VLOOKUP($A42,'GPIO Configuration'!$B$4:$I$97,8,FALSE)=\"下拉\",1,0)))","v":0},{"$f":"IF(ISNA(VLOOKUP($A42,'GPIO Configuration'!$B$4:$G$97,6,FALSE)),0,MATCH(VLOOKUP($A42,'GPIO Configuration'!$B$4:$G$97,6,FALSE),INDIRECT($A42&\"_Func\"),0)-1)","v":0},{"$f":"IF(ISNA(VLOOKUP($A42,'GPIO Configuration'!$B$4:$H$97,7,FALSE)),0,MATCH(VLOOKUP($A42,'GPIO Configuration'!$B$4:$H$97,7,FALSE),INDIRECT($A42&\"_OutDrv\"),0)-1)","v":3},{"$f":"IF(ISNA(VLOOKUP($A42,'GPIO Configuration'!$B$4:$M$97,12,FALSE)),0,IF(VLOOKUP($A42,'GPIO Configuration'!$B$4:$M$97,12,FALSE)=\"OUT - 输出\",1,0))","v":0},{"$f":"IF(ISNA(VLOOKUP($A42,'GPIO Configuration'!$B$4:$N$97,13,FALSE)),0,IF(VLOOKUP($A42,'GPIO Configuration'!$B$4:$N$97,13,FALSE)=\"1 - 高电平\",1,0))","v":0},{"$f":"IF(ISNA(VLOOKUP($A42,'GPIO Configuration'!$B$4:$S$97,18,FALSE)),0,IF(VLOOKUP($A42,'GPIO Configuration'!$B$4:$S$97,18,FALSE)=\"1 - 使能\",1,0))","v":1},{"$f":"IF(ISNA(VLOOKUP($A42,'GPIO Configuration'!$B$4:$R$97,17,FALSE)),0,MATCH(VLOOKUP($A42,'GPIO Configuration'!$B$4:$R$97,17,FALSE),INDIRECT($A42&\"_InLv\"),0)-1)","v":0},{"$f":"IF(ISNA(VLOOKUP($A42,'GPIO Configuration'!$B$4:$T$97,19,FALSE)),0,IF(VLOOKUP($A42,'GPIO Configuration'!$B$4:$T$97,19,FALSE)=\"1 - 使能\",1,0))","v":1},{"$f":"IF(ISNA(VLOOKUP($A42,'GPIO Configuration'!$B$4:$Q$97,16,FALSE)),0,IF(VLOOKUP($A42,'GPIO Configuration'!$B$4:$Q$97,16,FALSE)=\"上拉\",2,IF(VLOOKUP($A42,'GPIO Configuration'!$B$4:$Q$97,16,FALSE)=\"下拉\",1,0)))","v":0},{"$f":"IF(ISNA(VLOOKUP($A42,'GPIO Configuration'!$B$4:$O$97,14,FALSE)),0,MATCH(VLOOKUP($A42,'GPIO Configuration'!$B$4:$O$97,14,FALSE),INDIRECT($A42&\"_Func\"),0)-1)","v":0},{"$f":"IF(ISNA(VLOOKUP($A42,'GPIO Configuration'!$B$4:$P$97,15,FALSE)),0,MATCH(VLOOKUP($A42,'GPIO Configuration'!$B$4:$P$97,15,FALSE),INDIRECT($A42&\"_OutDrv\"),0)-1)","v":0}]
["P1_08",1,8,"0x0028","GPIO_PODR1_POD8","GPIO_PIDR1_PID8",{"$f":"IF(ISNA(VLOOKUP($A43,'GPIO Configuration'!$B$4:$C$97,2,FALSE)),0,1)","v":1},{"$f":"IF(ISNA(VLOOKUP($A43,'GPIO Configuration'!$B$4:$C$97,2,FALSE)),0,IF(VLOOKUP($A43,'GPIO Configuration'!$B$4:$C$97,2,FALSE)=\"是\",1,0))","v":1},{"$f":"IF(ISNA(VLOOKUP($A43,'GPIO Configuration'!$B$4:$D$97,3,FALSE)),\"\",TRIM(VLOOKUP($A43,'GPIO Configuration'!$B$4:$D$97,3,FALSE)))","v":"MCU_EEPROM_SCL"},{"$f":"IF(ISNA(VLOOKUP($A43,'GPIO Configuration'!$B$4:$E$97,4,FALSE)),0,IF(VLOOKUP($A43,'GPIO Configuration'!$B$4:$E$97,4,FALSE)=\"OUT - 输出\",1,0))","v":1},{"$f":"IF(ISNA(VLOOKUP($A43,'GPIO Configuration'!$B$4:$F$97,5,FALSE)),0,IF(VLOOKUP($A43,'GPIO Configuration'!$B$4:$F$97,5,FALSE)=\"1 - 高电平\",1,0))","v":0},{"$f":"IF(ISNA(VLOOKUP($A43,'GPIO Configuration'!$B$4:$K$97,10,FALSE)),0,IF(VLOOKUP($A43,'GPIO Configuration'!$B$4:$K$97,10,FALSE)=\"1 - 使能\",1,0))","v":1},{"$f":"IF(ISNA(VLOOKUP($A43,'GPIO Configuration'!$B$4:$J$97,9,FALSE)),0,MATCH(VLOOKUP($A43,'GPIO Configuration'!$B$4:$J$97,9,FALSE),INDIRECT($A43&\"_InLv\"),0)-1)","v":0},{"$f":"IF(ISNA(VLOOKUP($A43,'GPIO Configuration'!$B$4:$L$97,11,FALSE)),0,IF(VLOOKUP($A43,'GPIO Configuration'!$B$4:$L$97,11,FALSE)=\"1 - 使能\",1,0))","v":1},{"$f":"IF(ISNA(VLOOKUP($A43,'GPIO Configuration'!$B$4:$I$97,8,FALSE)),0,IF(VLOOKUP($A43,'GPIO Configuration'!$B$4:$I$97,8,FALSE)=\"上拉\",2,IF(VLOOKUP($A43,'GPIO Configuration'!$B$4:$I$97,8,FALSE)=\"下拉\",1,0)))","v":0},{"$f":"IF(ISNA(VLOOKUP($A43,'GPIO Configuration'!$B$4:$G$97,6,FALSE)),0,MATCH(VLOOKUP($A43,'GPIO Configuration'!$B$4:$G$97,6,FALSE),INDIRECT($A43&\"_Func\"),0)-1)","v":0},{"$f":"IF(ISNA(VLOOKUP($A43,'GPIO Configuration'!$B$4:$H$97,7,FALSE)),0,MATCH(VLOOKUP($A43,'GPIO Configuration'!$B$4:$H$97,7,FALSE),INDIRECT($A43&\"_OutDrv\"),0)-1)","v":3},{"$f":"IF(ISNA(VLOOKUP($A43,'GPIO Configuration'!$B$4:$M$97,12,FALSE)),0,IF(VLOOKUP($A43,'GPIO Configuration'!$B$4:$M$97,12,FALSE)=\"OUT - 输出\",1,0))","v":1},{"$f":"IF(ISNA(VLOOKUP($A43,'GPIO Configuration'!$B$4:$N$97,13,FALSE)),0,IF(VLOOKUP($A43,'GPIO Configuration'!$B$4:$N$97,13,FALSE)=\"1 - 高电平\",1,0))","v":1},{"$f":"IF(ISNA(VLOOKUP($A43,'GPIO Configuration'!$B$4:$S$97,18,FALSE)),0,IF(VLOOKUP($A43,'GPIO Configuration'!$B$4:$S$97,18,FALSE)=\"1 - 使能\",1,0))","v":0},{"$f":"IF(ISNA(VLOOKUP($A43,'GPIO Configuration'!$B$4:$R$97,17,FALSE)),0,MATCH(VLOOKUP($A43,'GPIO Configuration'!$B$4:$R$97,17,FALSE),INDIRECT($A43&\"_InLv\"),0)-1)","v":0},{"$f":"IF(ISNA(VLOOKUP($A43,'GPIO Configuration'!$B$4:$T$97,19,FALSE)),0,IF(VLOOKUP($A43,'GPIO Configuration'!$B$4:$T$97,19,FALSE)=\"1 - 使能\",1,0))","v":1},{"$f":"IF(ISNA(VLOOKUP($A43,'GPIO Configuration'!$B$4:$Q$97,16,FALSE)),0,IF(VLOOKUP($A43,'GPIO Configuration'!$B$4:$Q$97,16,FALSE)=\"上拉\",2,IF(VLOOKUP($A43,'GPIO Configuration'!$B$4:$Q$97,16,FALSE)=\"下拉\",1,0)))","v":0},{"$f":"IF(ISNA(VLOOKUP($A43,'GPIO Configuration'!$B$4:$O$97,14,FALSE)),0,MATCH(VLOOKUP($A43,'GPIO Configuration'!$B$4:$O$97,14,FALSE),INDIRECT($A43&\"_Func\"),0)-1)","v":0},{"$f":"IF(ISNA(VLOOKUP($A43,'GPIO Configuration'!$B$4:$P$97,15,FALSE)),0,MATCH(VLOOKUP($A43,'GPIO Configuration'!$B$4:$P$97,15,FALSE),INDIRECT($A43&\"_OutDrv\"),0)-1)","v":0}]
["P1_09",1,9,"0x0029","GPIO_PODR1_POD9","GPIO_PIDR1_PID9",{"$f":"IF(ISNA(VLOOKUP($A44,'GPIO Configuration'!$B$4:$C$97,2,FALSE)),0,1)","v":1},{"$f":"IF(ISNA(VLOOKUP($A44,'GPIO Configuration'!$B$4:$C$97,2,FALSE)),0,IF(VLOOKUP($A44,'GPIO Configuration'!$B$4:$C$97,2,FALSE)=\"是\",1,0))","v":1},{"$f":"IF(ISNA(VLOOKUP($A44,'GPIO Configuration'!$B$4:$D$97,3,FALSE)),\"\",TRIM(VLOOKUP($A44,'GPIO Configuration'!$B$4:$D$97,3,FALSE)))","v":"MCU_EEPROM_SDA"},{"$f":"IF(ISNA(VLOOKUP($A44,'GPIO Configuration'!$B$4:$E$97,4,FALSE)),0,IF(VLOOKUP($A44,'GPIO Configuration'!$B$4:$E$97,4,FALSE)=\"OUT - 输出\",1,0))","v":1},{"$f":"IF(ISNA(VLOOKUP($A44,'GPIO Configuration'!$B$4:$F$97,5,FALSE)),0,IF(VLOOKUP($A44,'GPIO Configuration'!$B$4:$F$97,5,FALSE)=\"1 - 高电平\",1,0))","v":0},{"$f":"IF(ISNA(VLOOKUP($A44,'GPIO Configuration'!$B$4:$K$97,10,FALSE)),0,IF(VLOOKUP($A44,'GPIO Configuration'!$B$4:$K$97,10,FALSE)=\"1 - 使能\",1,0))","v":1},{"$f":"IF(ISNA(VLOOKUP($A44,'GPIO Configuration'!$B$4:$J$97,9,FALSE)),0,MATCH(VLOOKUP($A44,'GPIO Configuration'!$B$4:$J$97,9,FALSE),INDIRECT($A44&\"_InLv\"),0)-1)","v":0},{"$f":"IF(ISNA(VLOOKUP($A44,'GPIO Configuration'!$B$4:$L$97,11,FALSE)),0,IF(VLOOKUP($A44,'GPIO Configuration'!$B$4:$L$97,11,FALSE)=\"1 - 使能\",1,0))","v":1},{"$f":"IF(ISNA(VLOOKUP($A44,'GPIO Configuration'!$B$4:$I$97,8,FALSE)),0,IF(VLOOKUP($A44,'GPIO Configuration'!$B$4:$I$97,8,FALSE)=\"上拉\",2,IF(VLOOKUP($A44,'GPIO Configuration'!$B$4:$I$97,8,FALSE)=\"下拉\",1,0)))","v":0},{"$f":"IF(ISNA(VLOOKUP($A44,'GPIO Configuration'!$B$4:$G$97,6,FALSE)),0,MATCH(VLOOKUP($A44,'GPIO Configuration'!$B$4:$G$97,6,FALSE),INDIRECT($A44&\"_Func\"),0)-1)","v":0},{"$f":"IF(ISNA(VLOOKUP($A44,'GPIO Configuration'!$B$4:$H$97,7,FALSE)),0,MATCH(VLOOKUP($A44,'GPIO Configuration'!$B$4:$H$97,7,FALSE),INDIRECT($A44&\"_OutDrv\"),0)-1)","v":3},{"$f":"IF(ISNA(VLOOKUP($A44,'GPIO Configuration'!$B$4:$M$97,12,FALSE)),0,IF(VLOOKUP($A44,'GPIO Configuration'!$B$4:$M$97,12,FALSE)=\"OUT - 输出\",1,0))","v":1},{"$f":"IF(ISNA(VLOOKUP($A44,'GPIO Configuration'!$B$4:$N$97,13,FALSE)),0,IF(VLOOKUP($A44,'GPIO Configuration'!$B$4:$N$97,13,FALSE)=\"1 - 高电平\",1,0))","v":1},{"$f":"IF(ISNA(VLOOKUP($A44,'GPIO Configuration'!$B$4:$S$97,18,FALSE)),0,IF(VLOOKUP($A44,'GPIO Configuration'!$B$4:$S$97,18,FALSE)=\"1 - 使能\",1,0))","v":0},{"$f":"IF(ISNA(VLOOKUP($A44,'GPIO Configuration'!$B$4:$R$97,17,FALSE)),0,MATCH(VLOOKUP($A44,'GPIO Configuration'!$B$4:$R$97,17,FALSE),INDIRECT($A44&\"_InLv\"),0)-1)","v":0},{"$f":"IF(ISNA(VLOOKUP($A44,'GPIO Configuration'!$B$4:$T$97,19,FALSE)),0,IF(VLOOKUP($A44,'GPIO Configuration'!$B$4:$T$97,19,FALSE)=\"1 - 使能\",1,0))","v":1},{"$f":"IF(ISNA(VLOOKUP($A44,'GPIO Configuration'!$B$4:$Q$97,16,FALSE)),0,IF(VLOOKUP($A44,'GPIO Configuration'!$B$4:$Q$97,16,FALSE)=\"上拉\",2,IF(VLOOKUP($A44,'GPIO Configuration'!$B$4:$Q$97,16,FALSE)=\"下拉\",1,0)))","v":0},{"$f":"IF(ISNA(VLOOKUP($A44,'GPIO Configuration'!$B$4:$O$97,14,FALSE)),0,MATCH(VLOOKUP($A44,'GPIO Configuration'!$B$4:$O$97,14,FALSE),INDIRECT($A44&\"_Func\"),0)-1)","v":0},{"$f":"IF(ISNA(VLOOKUP($A44,'GPIO Configuration'!$B$4:$P$97,15,FALSE)),0,MATCH(VLOOKUP($A44,'GPIO Configuration'!$B$4:$P$97,15,FALSE),INDIRECT($A44&\"_OutDrv\"),0)-1)","v":0}]
["P1_10",1,10,"0x002A","GPIO_PODR1_POD10","GPIO_PIDR1_PID10",{"$f":"IF(ISNA(VLOOKUP($A45,'GPIO Configuration'!$B$4:$C$97,2,FALSE)),0,1)","v":1},{"$f":"IF(ISNA(VLOOKUP($A45,'GPIO Configuration'!$B$4:$C$97,2,FALSE)),0,IF(VLOOKUP($A45,'GPIO Configuration'!$B$4:$C$97,2,FALSE)=\"是\",1,0))","v":1},{"$f":"IF(ISNA(VLOOKUP($A45,'GPIO Configuration'!$B$4:$D$97,3,FALSE)),\"\",TRIM(VLOOKUP($A45,'GPIO Configuration'!$B$4:$D$97,3,FALSE)))","v":"GPIO_KL15"},{"$f":"IF(ISNA(VLOOKUP($A45,'GPIO Configuration'!$B$4:$E$97,4,FALSE)),0,IF(VLOOKUP($A45,'GPIO Configuration'!$B$4:$E$97,4,FALSE)=\"OUT - 输出\",1,0))","v":0},{"$f":"IF(ISNA(VLOOKUP($A45,'GPIO Configuration'!$B$4:$F$97,5,FALSE)),0,IF(VLOOKUP($A45,'GPIO Configuration'!$B$4:$F$97,5,FALSE)=\"1 - 高电平\",1,0))","v":0},{"$f":"IF(ISNA(VLOOKUP($A45,'GPIO Configuration'!$B$4:$K$97,10,FALSE)),0,IF(VLOOKUP($A45,'GPIO Configuration'!$B$4:$K$97,10,FALSE)=\"1 - 使能\",1,0))","v":1},{"$f":"IF(ISNA(VLOOKUP($A45,'GPIO Configuration'!$B$4:$J$97,9,FALSE)),0,MATCH(VLOOKUP($A45,'GPIO Configuration'!$B$4:$J$97,9,FALSE),INDIRECT($A45&\"_InLv\"),0)-1)","v":0},{"$f":"IF(ISNA(VLOOKUP($A45,'GPIO Configuration'!$B$4:$L$97,11,FALSE)),0,IF(VLOOKUP($A45,'GPIO Configuration'!$B$4:$L$97,11,FALSE)=\"1 - 使能\",1,0))","v":1},{"$f":"IF(ISNA(VLOOKUP($A45,'GPIO Configuration'!$B$4:$I$97,8,FALSE)),0,IF(VLOOKUP($A45,'GPIO Configuration'!$B$4:$I$97,8,FALSE)=\"上拉\",2,IF(VLOOKUP($A45,'GPIO Configuration'!$B$4:$I$97,8,FALSE)=\"下拉\",1,0)))","v":0},{"$f":"IF(ISNA(VLOOKUP($A45,'GPIO Configuration'!$B$4:$G$97,6,FALSE)),0,MATCH(VLOOKUP($A45,'GPIO Configuration'!$B$4:$G$97,6,FALSE),INDIRECT($A45&\"_Func\"),0)-1)","v":0},{"$f":"IF(ISNA(VLOOKUP($A45,'GPIO Configuration'!$B$4:$H$97,7,FALSE)),0,MATCH(VLOOKUP($A45,'GPIO Configuration'!$B$4:$H$97,7,FALSE),INDIRECT($A45&\"_OutDrv\"),0)-1)","v":3},{"$f":"IF(ISNA(VLOOKUP($A45,'GPIO Configuration'!$B$4:$M$97,12,FALSE)),0,IF(VLOOKUP($A45,'GPIO Configuration'!$B$4:$M$97,12,FALSE)=\"OUT - 输出\",1,0))","v":0},{"$f":"IF(ISNA(VLOOKUP($A45,'GPIO Configuration'!$B$4:$N$97,13,FALSE)),0,IF(VLOOKUP($A45,'GPIO Configuration'!$B$4:$N$97,13,FALSE)=\"1 - 高电平\",1,0))","v":0},{"$f":"IF(ISNA(VLOOKUP($A45,'GPIO Configuration'!$B$4:$S$97,18,FALSE)),0,IF(VLOOKUP($A45,'GPIO Configuration'!$B$4:$S$97,18,FALSE)=\"1 - 使能\",1,0))","v":1},{"$f":"IF(ISNA(VLOOKUP($A45,'GPIO Configuration'!$B$4:$R$97,17,FALSE)),0,MATCH(VLOOKUP($A45,'GPIO Configuration'!$B$4:$R$97,17,FALSE),INDIRECT($A45&\"_InLv\"),0)-1)","v":0},{"$f":"IF(ISNA(VLOOKUP($A45,'GPIO Configuration'!$B$4:$T$97,19,FALSE)),0,IF(VLOOKUP($A45,'GPIO Configuration'!$B$4:$T$97,19,FALSE)=\"1 - 使能\",1,0))","v":1},{"$f":"IF(ISNA(VLOOKUP($A45,'GPIO Configuration'!$B$4:$Q$97,16,FALSE)),0,IF(VLOOKUP($A45,'GPIO Configuration'!$B$4:$Q$97,16,FALSE)=\"上拉\",2,IF(VLOOKUP($A45,'GPIO Configuration'!$B$4:$Q$97,16,FALSE)=\"下拉\",1,0)))","v":0},{"$f":"IF(ISNA(VLOOKUP($A45,'GPIO Configuration'!$B$4:$O$97,14,FALSE)),0,MATCH(VLOOKUP($A45,'GPIO Configuration'!$B$4:$O$97,14,FALSE),INDIRECT($A45&\"_Func\"),0)-1)","v":0},{"$f":"IF(ISNA(VLOOKUP($A45,'GPIO Configuration'!$B$4:$P$97,15,FALSE)),0,MATCH(VLOOKUP($A45,'GPIO Configuration'!$B$4:$P$97,15,FALSE),INDIRECT($A45&\"_OutDrv\"),0)-1)","v":0}]
["P1_11",1,11,"0x002B","GPIO_PODR1_POD11","GPIO_PIDR1_PID11",{"$f":"IF(ISNA(VLOOKUP($A46,'GPIO Configuration'!$B$4:$C$97,2,FALSE)),0,1)","v":1},{"$f":"IF(ISNA(VLOOKUP($A46,'GPIO Configuration'!$B$4:$C$97,2,FALSE)),0,IF(VLOOKUP($A46,'GPIO Configuration'!$B$4:$C$97,2,FALSE)=\"是\",1,0))","v":1},{"$f":"IF(ISNA(VLOOKUP($A46,'GPIO Configuration'!$B$4:$D$97,3,FALSE)),\"\",TRIM(VLOOKUP($A46,'GPIO Configuration'!$B$4:$D$97,3,FALSE)))","v":"SD_MODE_MCU"},{"$f":"IF(ISNA(VLOOKUP($A46,'GPIO Configuration'!$B$4:$E$97,4,FALSE)),0,IF(VLOOKUP($A46,'GPIO Configuration'!$B$4:$E$97,4,FALSE)=\"OUT - 输出\",1,0))","v":1},{"$f":"IF(ISNA(VLOOKUP($A46,'GPIO Configuration'!$B$4:$F$97,5,FALSE)),0,IF(VLOOKUP($A46,'GPIO Configuration'!$B$4:$F$97,5,FALSE)=\"1 - 高电平\",1,0))","v":0},{"$f":"IF(ISNA(VLOOKUP($A46,'GPIO Configuration'!$B$4:$K$97,10,FALSE)),0,IF(VLOOKUP($A46,'GPIO Configuration'!$B$4:$K$97,10,FALSE)=\"1 - 使能\",1,0))","v":0},{"$f":"IF(ISNA(VLOOKUP($A46,'GPIO Configuration'!$B$4:$J$97,9,FALSE)),0,MATCH(VLOOKUP($A46,'GPIO Configuration'!$B$4:$J$97,9,FALSE),INDIRECT($A46&\"_InLv\"),0)-1)","v":0},{"$f":"IF(ISNA(VLOOKUP($A46,'GPIO Configuration'!$B$4:$L$97,11,FALSE)),0,IF(VLOOKUP($A46,'GPIO Configuration'!$B$4:$L$97,11,FALSE)=\"1 - 使能\",1,0))","v":1},{"$f":"IF(ISNA(VLOOKUP($A46,'GPIO Configuration'!$B$4:$I$97,8,FALSE)),0,IF(VLOOKUP($A46,'GPIO Configuration'!$B$4:$I$97,8,FALSE)=\"上拉\",2,IF(VLOOKUP($A46,'GPIO Configuration'!$B$4:$I$97,8,FALSE)=\"下拉\",1,0)))","v":0},{"$f":"IF(ISNA(VLOOKUP($A46,'GPIO Configuration'!$B$4:$G$97,6,FALSE)),0,MATCH(VLOOKUP($A46,'GPIO Configuration'!$B$4:$G$97,6,FALSE),INDIRECT($A46&\"_Func\"),0)-1)","v":0},{"$f":"IF(ISNA(VLOOKUP($A46,'GPIO Configuration'!$B$4:$H$97,7,FALSE)),0,MATCH(VLOOKUP($A46,'GPIO Configuration'!$B$4:$H$97,7,FALSE),INDIRECT($A46&\"_OutDrv\"),0)-1)","v":3},{"$f":"IF(ISNA(VLOOKUP($A46,'GPIO Configuration'!$B$4:$M$97,12,FALSE)),0,IF(VLOOKUP($A46,'GPIO Configuration'!$B$4:$M$97,12,FALSE)=\"OUT - 输出\",1,0))","v":1},{"$f":"IF(ISNA(VLOOKUP($A46,'GPIO Configuration'!$B$4:$N$97,13,FALSE)),0,IF(VLOOKUP($A46,'GPIO Configuration'!$B$4:$N$97,13,FALSE)=\"1 - 高电平\",1,0))","v":0},{"$f":"IF(ISNA(VLOOKUP($A46,'GPIO Configuration'!$B$4:$S$97,18,FALSE)),0,IF(VLOOKUP($A46,'GPIO Configuration'!$B$4:$S$97,18,FALSE)=\"1 - 使能\",1,0))","v":1},{"$f":"IF(ISNA(VLOOKUP($A46,'GPIO Configuration'!$B$4:$R$97,17,FALSE)),0,MATCH(VLOOKUP($A46,'GPIO Configuration'!$B$4:$R$97,17,FALSE),INDIRECT($A46&\"_InLv\"),0)-1)","v":0},{"$f":"IF(ISNA(VLOOKUP($A46,'GPIO Configuration'!$B$4:$T$97,19,FALSE)),0,IF(VLOOKUP($A46,'GPIO Configuration'!$B$4:$T$97,19,FALSE)=\"1 - 使能\",1,0))","v":0},{"$f":"IF(ISNA(VLOOKUP($A46,'GPIO Configuration'!$B$4:$Q$97,16,FALSE)),0,IF(VLOOKUP($A46,'GPIO Configuration'!$B$4:$Q$97,16,FALSE)=\"上拉\",2,IF(VLOOKUP($A46,'GPIO Configuration'!$B$4:$Q$97,16,FALSE)=\"下拉\",1,0)))","v":0},{"$f":"IF(ISNA(VLOOKUP($A46,'GPIO Configuration'!$B$4:$O$97,14,FALSE)),0,MATCH(VLOOKUP($A46,'GPIO Configuration'!$B$4:$O$97,14,FALSE),INDIRECT($A46&\"_Func\"),0)-1)","v":0},{"$f":"IF(ISNA(VLOOKUP($A46,'GPIO Configuration'!$B$4:$P$97,15,FALSE)),0,MATCH(VLOOKUP($A46,'GPIO Configuration'!$B$4:$P$97,15,FALSE),INDIRECT($A46&\"_OutDrv\"),0)-1)","v":0}]
["P1_12",1,12,"0x002C","GPIO_PODR1_POD12","GPIO_PIDR1_PID12",{"$f":"IF(ISNA(VLOOKUP($A47,'GPIO Configuration'!$B$4:$C$97,2,FALSE)),0,1)","v":1},{"$f":"IF(ISNA(VLOOKUP($A47,'GPIO Configuration'!$B$4:$C$97,2,FALSE)),0,IF(VLOOKUP($A47,'GPIO Configuration'!$B$4:$C$97,2,FALSE)=\"是\",1,0))","v":1},{"$f":"IF(ISNA(VLOOKUP($A47,'GPIO Configuration'!$B$4:$D$97,3,FALSE)),\"\",TRIM(VLOOKUP($A47,'GPIO Configuration'!$B$4:$D$97,3,FALSE)))","v":"FM_MODE_MCU"},{"$f":"IF(ISNA(VLOOKUP($A47,'GPIO Configuration'!$B$4:$E$97,4,FALSE)),0,IF(VLOOKUP($A47,'GPIO Configuration'!$B$4:$E$97,4,FALSE)=\"OUT - 输出\",1,0))","v":1},{"$f":"IF(ISNA(VLOOKUP($A47,'GPIO Configuration'!$B$4:$F$97,5,FALSE)),0,IF(VLOOKUP($A47,'GPIO Configuration'!$B$4:$F$97,5,FALSE)=\"1 - 高电平\",1,0))","v":0},{"$f":"IF(ISNA(VLOOKUP($A47,'GPIO Configuration'!$B$4:$K$97,10,FALSE)),0,IF(VLOOKUP($A47,'GPIO Configuration'!$B$4:$K$97,10,FALSE)=\"1 - 使能\",1,0))","v":0},{"$f":"IF(ISNA(VLOOKUP($A47,'GPIO Configuration'!$B$4:$J$97,9,FALSE)),0,MATCH(VLOOKUP($A47,'GPIO Configuration'!$B$4:$J$97,9,FALSE),INDIRECT($A47&\"_InLv\"),0)-1)","v":0},{"$f":"IF(ISNA(VLOOKUP($A47,'GPIO Configuration'!$B$4:$L$97,11,FALSE)),0,IF(VLOOKUP($A47,'GPIO Configuration'!$B$4:$L$97,11,FALSE)=\"1 - 使能\",1,0))","v":1},{"$f":"IF(ISNA(VLOOKUP($A47,'GPIO Configuration'!$B$4:$I$97,8,FALSE)),0,IF(VLOOKUP($A47,'GPIO Configuration'!$B$4:$I$97,8,FALSE)=\"上拉\",2,IF(VLOOKUP($A47,'GPIO Configuration'!$B$4:$I$97,8,FALSE)=\"下拉\",1,0)))","v":0},{"$f":"IF(ISNA(VLOOKUP($A47,'GPIO Configuration'!$B$4:$G$97,6,FALSE)),0,MATCH(VLOOKUP($A47,'GPIO Configuration'!$B$4:$G$97,6,FALSE),INDIRECT($A47&\"_Func\"),0)-1)","v":6},{"$f":"IF(ISNA(VLOOKUP($A47,'GPIO Configuration'!$B$4:$H$97,7,FALSE)),0,MATCH(VLOOKUP($A47,'GPIO Configuration'!$B$4:$H$97,7,FALSE),INDIRECT($A47&\"_OutDrv\"),0)-1)","v":3},{"$f":"IF(ISNA(VLOOKUP($A47,'GPIO Configuration'!$B$4:$M$97,12,FALSE)),0,IF(VLOOKUP($A47,'GPIO Configuration'!$B$4:$M$97,12,FALSE)=\"OUT - 输出\",1,0))","v":1},{"$f":"IF(ISNA(VLOOKUP($A47,'GPIO Configuration'!$B$4:$N$97,13,FALSE)),0,IF(VLOOKUP($A47,'GPIO Configuration'!$B$4:$N$97,13,FALSE)=\"1 - 高电平\",1,0))","v":0},{"$f":"IF(ISNA(VLOOKUP($A47,'GPIO Configuration'!$B$4:$S$97,18,FALSE)),0,IF(VLOOKUP($A47,'GPIO Configuration'!$B$4:$S$97,18,FALSE)=\"1 - 使能\",1,0))","v":1},{"$f":"IF(ISNA(VLOOKUP($A47,'GPIO Configuration'!$B$4:$R$97,17,FALSE)),0,MATCH(VLOOKUP($A47,'GPIO Configuration'!$B$4:$R$97,17,FALSE),INDIRECT($A47&\"_InLv\"),0)-1)","v":0},{"$f":"IF(ISNA(VLOOKUP($A47,'GPIO Configuration'!$B$4:$T$97,19,FALSE)),0,IF(VLOOKUP($A47,'GPIO Configuration'!$B$4:$T$97,19,FALSE)=\"1 - 使能\",1,0))","v":0},{"$f":"IF(ISNA(VLOOKUP($A47,'GPIO Configuration'!$B$4:$Q$97,16,FALSE)),0,IF(VLOOKUP($A47,'GPIO Configuration'!$B$4:$Q$97,16,FALSE)=\"上拉\",2,IF(VLOOKUP($A47,'GPIO Configuration'!$B$4:$Q$97,16,FALSE)=\"下拉\",1,0)))","v":0},{"$f":"IF(ISNA(VLOOKUP($A47,'GPIO Configuration'!$B$4:$O$97,14,FALSE)),0,MATCH(VLOOKUP($A47,'GPIO Configuration'!$B$4:$O$97,14,FALSE),INDIRECT($A47&\"_Func\"),0)-1)","v":0},{"$f":"IF(ISNA(VLOOKUP($A47,'GPIO Configuration'!$B$4:$P$97,15,FALSE)),0,MATCH(VLOOKUP($A47,'GPIO Configuration'!$B$4:$P$97,15,FALSE),INDIRECT($A47&\"_OutDrv\"),0)-1)","v":0}]
["P1_13",1,13,"0x002D","GPIO_PODR1_POD13","GPIO_PIDR1_PID13",{"$f":"IF(ISNA(VLOOKUP($A48,'GPIO Configuration'!$B$4:$C$97,2,FALSE)),0,1)","v":1},{"$f":"IF(ISNA(VLOOKUP($A48,'GPIO Configuration'!$B$4:$C$97,2,FALSE)),0,IF(VLOOKUP($A48,'GPIO Configuration'!$B$4:$C$97,2,FALSE)=\"是\",1,0))","v":0},{"$f":"IF(ISNA(VLOOKUP($A48,'GPIO Configuration'!$B$4:$D$97,3,FALSE)),\"\",TRIM(VLOOKUP($A48,'GPIO Configuration'!$B$4:$D$97,3,FALSE)))","v":"KL_30_AD"},{"$f":"IF(ISNA(VLOOKUP($A48,'GPIO Configuration'!$B$4:$E$97,4,FALSE)),0,IF(VLOOKUP($A48,'GPIO Configuration'!$B$4:$E$97,4,FALSE)=\"OUT - 输出\",1,0))","v":0},{"$f":"IF(ISNA(VLOOKUP($A48,'GPIO Configuration'!$B$4:$F$97,5,FALSE)),0,IF(VLOOKUP($A48,'GPIO Configuration'!$B$4:$F$97,5,FALSE)=\"1 - 高电平\",1,0))","v":0},{"$f":"IF(ISNA(VLOOKUP($A48,'GPIO Configuration'!$B$4:$K$97,10,FALSE)),0,IF(VLOOKUP($A48,'GPIO Configuration'!$B$4:$K$97,10,FALSE)=\"1 - 使能\",1,0))","v":1},{"$f":"IF(ISNA(VLOOKUP($A48,'GPIO Configuration'!$B$4:$J$97,9,FALSE)),0,MATCH(VLOOKUP($A48,'GPIO Configuration'!$B$4:$J$97,9,FALSE),INDIRECT($A48&\"_InLv\"),0)-1)","v":0},{"$f":"IF(ISNA(VLOOKUP($A48,'GPIO Configuration'!$B$4:$L$97,11,FALSE)),0,IF(VLOOKUP($A48,'GPIO Configuration'!$B$4:$L$97,11,FALSE)=\"1 - 使能\",1,0))","v":0},{"$f":"IF(ISNA(VLOOKUP($A48,'GPIO Configuration'!$B$4:$I$97,8,FALSE)),0,IF(VLOOKUP($A48,'GPIO Configuration'!$B$4:$I$97,8,FALSE)=\"上拉\",2,IF(VLOOKUP($A48,'GPIO Configuration'!$B$4:$I$97,8,FALSE)=\"下拉\",1,0)))","v":0},{"$f":"IF(ISNA(VLOOKUP($A48,'GPIO Configuration'!$B$4:$G$97,6,FALSE)),0,MATCH(VLOOKUP($A48,'GPIO Configuration'!$B$4:$G$97,6,FALSE),INDIRECT($A48&\"_Func\"),0)-1)","v":0},{"$f":"IF(ISNA(VLOOKUP($A48,'GPIO Configuration'!$B$4:$H$97,7,FALSE)),0,MATCH(VLOOKUP($A48,'GPIO Configuration'!$B$4:$H$97,7,FALSE),INDIRECT($A48&\"_OutDrv\"),0)-1)","v":3},{"$f":"IF(ISNA(VLOOKUP($A48,'GPIO Configuration'!$B$4:$M$97,12,FALSE)),0,IF(VLOOKUP($A48,'GPIO Configuration'!$B$4:$M$97,12,FALSE)=\"OUT - 输出\",1,0))","v":0},{"$f":"IF(ISNA(VLOOKUP($A48,'GPIO Configuration'!$B$4:$N$97,13,FALSE)),0,IF(VLOOKUP($A48,'GPIO Configuration'!$B$4:$N$97,13,FALSE)=\"1 - 高电平\",1,0))","v":0},{"$f":"IF(ISNA(VLOOKUP($A48,'GPIO Configuration'!$B$4:$S$97,18,FALSE)),0,IF(VLOOKUP($A48,'GPIO Configuration'!$B$4:$S$97,18,FALSE)=\"1 - 使能\",1,0))","v":1},{"$f":"IF(ISNA(VLOOKUP($A48,'GPIO Configuration'!$B$4:$R$97,17,FALSE)),0,MATCH(VLOOKUP($A48,'GPIO Configuration'!$B$4:$R$97,17,FALSE),INDIRECT($A48&\"_InLv\"),0)-1)","v":0},{"$f":"IF(ISNA(VLOOKUP($A48,'GPIO Configuration'!$B$4:$T$97,19,FALSE)),0,IF(VLOOKUP($A48,'GPIO Configuration'!$B$4:$T$97,19,FALSE)=\"1 - 使能\",1,0))","v":0},{"$f":"IF(ISNA(VLOOKUP($A48,'GPIO Configuration'!$B$4:$Q$97,16,FALSE)),0,IF(VLOOKUP($A48,'GPIO Configuration'!$B$4:$Q$97,16,FALSE)=\"上拉\",2,IF(VLOOKUP($A48,'GPIO Configuration'!$B$4:$Q$97,16,FALSE)=\"下拉\",1,0)))","v":0},{"$f":"IF(ISNA(VLOOKUP($A48,'GPIO Configuration'!$B$4:$O$97,14,FALSE)),0,MATCH(VLOOKUP($A48,'GPIO Configuration'!$B$4:$O$97,14,FALSE),INDIRECT($A48&\"_Func\"),0)-1)","v":0},{"$f":"IF(ISNA(VLOOKUP($A48,'GPIO Configuration'!$B$4:$P$97,15,FALSE)),0,MATCH(VLOOKUP($A48,'GPIO Configuration'!$B$4:$P$97,15,FALSE),INDIRECT($A48&\"_OutDrv\"),0)-1)","v":0}]
["P1_14",1,14,"0x002E","GPIO_PODR1_POD14","GPIO_PIDR1_PID14",{"$f":"IF(ISNA(VLOOKUP($A49,'GPIO Configuration'!$B$4:$C$97,2,FALSE)),0,1)","v":1},{"$f":"IF(ISNA(VLOOKUP($A49,'GPIO Configuration'!$B$4:$C$97,2,FALSE)),0,IF(VLOOKUP($A49,'GPIO Configuration'!$B$4:$C$97,2,FALSE)=\"是\",1,0))","v":0},{"$f":"IF(ISNA(VLOOKUP($A49,'GPIO Configuration'!$B$4:$D$97,3,FALSE)),\"\",TRIM(VLOOKUP($A49,'GPIO Configuration'!$B$4:$D$97,3,FALSE)))","v":""},{"$f":"IF(ISNA(VLOOKUP($A49,'GPIO Configuration'!$B$4:$E$97,4,FALSE)),0,IF(VLOOKUP($A49,'GPIO Configuration'!$B$4:$E$97,4,FALSE)=\"OUT - 输出\",1,0))","v":0},{"$f":"IF(ISNA(VLOOKUP($A49,'GPIO Configuration'!$B$4:$F$97,5,FALSE)),0,IF(VLOOKUP($A49,'GPIO Configuration'!$B$4:$F$97,5,FALSE)=\"1 - 高电平\",1,0))","v":0},{"$f":"IF(ISNA(VLOOKUP($A49,'GPIO Configuration'!$B$4:$K$97,10,FALSE)),0,IF(VLOOKUP($A49,'GPIO Configuration'!$B$4:$K$97,10,FALSE)=\"1 - 使能\",1,0))","v":1},{"$f":"IF(ISNA(VLOOKUP($A49,'GPIO Configuration'!$B$4:$J$97,9,FALSE)),0,MATCH(VLOOKUP($A49,'GPIO Configuration'!$B$4:$J$97,9,FALSE),INDIRECT($A49&\"_InLv\"),0)-1)","v":0},{"$f":"IF(ISNA(VLOOKUP($A49,'GPIO Configuration'!$B$4:$L$97,11,FALSE)),0,IF(VLOOKUP($A49,'GPIO Configuration'!$B$4:$L$97,11,FALSE)=\"1 - 使能\",1,0))","v":0},{"$f":"IF(ISNA(VLOOKUP($A49,'GPIO Configuration'!$B$4:$I$97,8,FALSE)),0,IF(VLOOKUP($A49,'GPIO Configuration'!$B$4:$I$97,8,FALSE)=\"上拉\",2,IF(VLOOKUP($A49,'GPIO Configuration'!$B$4:$I$97,8,FALSE)=\"下拉\",1,0)))","v":0},{"$f":"IF(ISNA(VLOOKUP($A49,'GPIO Configuration'!$B$4:$G$97,6,FALSE)),0,MATCH(VLOOKUP($A49,'GPIO Configuration'!$B$4:$G$97,6,FALSE),INDIRECT($A49&\"_Func\"),0)-1)","v":0},{"$f":"IF(ISNA(VLOOKUP($A49,'GPIO Configuration'!$B$4:$H$97,7,FALSE)),0,MATCH(VLOOKUP($A49,'GPIO Configuration'!$B$4:$H$97,7,FALSE),INDIRECT($A49&\"_OutDrv\"),0)-1)","v":3},{"$f":"IF(ISNA(VLOOKUP($A49,'GPIO Configuration'!$B$4:$M$97,12,FALSE)),0,IF(VLOOKUP($A49,'GPIO Configuration'!$B$4:$M$97,12,FALSE)=\"OUT - 输出\",1,0))","v":0},{"$f":"IF(ISNA(VLOOKUP($A49,'GPIO Configuration'!$B$4:$N$97,13,FALSE)),0,IF(VLOOKUP($A49,'GPIO Configuration'!$B$4:$N$97,13,FALSE)=\"1 - 高电平\",1,0))","v":0},{"$f":"IF(ISNA(VLOOKUP($A49,'GPIO Configuration'!$B$4:$S$97,18,FALSE)),0,IF(VLOOKUP($A49,'GPIO Configuration'!$B$4:$S$97,18,FALSE)=\"1 - 使能\",1,0))","v":1},{"$f":"IF(ISNA(VLOOKUP($A49,'GPIO Configuration'!$B$4:$R$97,17,FALSE)),0,MATCH(VLOOKUP($A49,'GPIO Configuration'!$B$4:$R$97,17,FALSE),INDIRECT($A49&\"_InLv\"),0)-1)","v":0},{"$f":"IF(ISNA(VLOOKUP($A49,'GPIO Configuration'!$B$4:$T$97,19,FALSE)),0,IF(VLOOKUP($A49,'GPIO Configuration'!$B$4:$T$97,19,FALSE)=\"1 - 使能\",1,0))","v":0},{"$f":"IF(ISNA(VLOOKUP($A49,'GPIO Configuration'!$B$4:$Q$97,16,FALSE)),0,IF(VLOOKUP($A49,'GPIO Configuration'!$B$4:$Q$97,16,FALSE)=\"上拉\",2,IF(VLOOKUP($A49,'GPIO Configuration'!$B$4:$Q$97,16,FALSE)=\"下拉\",1,0)))","v":0},{"$f":"IF(ISNA(VLOOKUP($A49,'GPIO Configuration'!$B$4:$O$97,14,FALSE)),0,MATCH(VLOOKUP($A49,'GPIO Configuration'!$B$4:$O$97,14,FALSE),INDIRECT($A49&\"_Func\"),0)-1)","v":0},{"$f":"IF(ISNA(VLOOKUP($A49,'GPIO Configuration'!$B$4:$P$97,15,FALSE)),0,MATCH(VLOOKUP($A49,'GPIO Configuration'!$B$4:$P$97,15,FALSE),INDIRECT($A49&\"_OutDrv\"),0)-1)","v":0}]
["P1_15",1,15,"0x002F","GPIO_PODR1_POD15","GPIO_PIDR1_PID15",{"$f":"IF(ISNA(VLOOKUP($A50,'GPIO Configuration'!$B$4:$C$97,2,FALSE)),0,1)","v":1},{"$f":"IF(ISNA(VLOOKUP($A50,'GPIO Configuration'!$B$4:$C$97,2,FALSE)),0,IF(VLOOKUP($A50,'GPIO Configuration'!$B$4:$C$97,2,FALSE)=\"是\",1,0))","v":1},{"$f":"IF(ISNA(VLOOKUP($A50,'GPIO Configuration'!$B$4:$D$97,3,FALSE)),\"\",TRIM(VLOOKUP($A50,'GPIO Configuration'!$B$4:$D$97,3,FALSE)))","v":"PW_OUT"},{"$f":"IF(ISNA(VLOOKUP($A50,'GPIO Configuration'!$B$4:$E$97,4,FALSE)),0,IF(VLOOKUP($A50,'GPIO Configuration'!$B$4:$E$97,4,FALSE)=\"OUT - 输出\",1,0))","v":1},{"$f":"IF(ISNA(VLOOKUP($A50,'GPIO Configuration'!$B$4:$F$97,5,FALSE)),0,IF(VLOOKUP($A50,'GPIO Configuration'!$B$4:$F$97,5,FALSE)=\"1 - 高电平\",1,0))","v":0},{"$f":"IF(ISNA(VLOOKUP($A50,'GPIO Configuration'!$B$4:$K$97,10,FALSE)),0,IF(VLOOKUP($A50,'GPIO Configuration'!$B$4:$K$97,10,FALSE)=\"1 - 使能\",1,0))","v":0},{"$f":"IF(ISNA(VLOOKUP($A50,'GPIO Configuration'!$B$4:$J$97,9,FALSE)),0,MATCH(VLOOKUP($A50,'GPIO Configuration'!$B$4:$J$97,9,FALSE),INDIRECT($A50&\"_InLv\"),0)-1)","v":0},{"$f":"IF(ISNA(VLOOKUP($A50,'GPIO Configuration'!$B$4:$L$97,11,FALSE)),0,IF(VLOOKUP($A50,'GPIO Configuration'!$B$4:$L$97,11,FALSE)=\"1 - 使能\",1,0))","v":1},{"$f":"IF(ISNA(VLOOKUP($A50,'GPIO Configuration'!$B$4:$I$97,8,FALSE)),0,IF(VLOOKUP($A50,'GPIO Configuration'!$B$4:$I$97,8,FALSE)=\"上拉\",2,IF(VLOOKUP($A50,'GPIO Configuration'!$B$4:$I$97,8,FALSE)=\"下拉\",1,0)))","v":0},{"$f":"IF(ISNA(VLOOKUP($A50,'GPIO Configuration'!$B$4:$G$97,6,FALSE)),0,MATCH(VLOOKUP($A50,'GPIO Configuration'!$B$4:$G$97,6,FALSE),INDIRECT($A50&\"_Func\"),0)-1)","v":6},{"$f":"IF(ISNA(VLOOKUP($A50,'GPIO Configuration'!$B$4:$H$97,7,FALSE)),0,MATCH(VLOOKUP($A50,'GPIO Configuration'!$B$4:$H$97,7,FALSE),INDIRECT($A50&\"_OutDrv\"),0)-1)","v":3},{"$f":"IF(ISNA(VLOOKUP($A50,'GPIO Configuration'!$B$4:$M$97,12,FALSE)),0,IF(VLOOKUP($A50,'GPIO Configuration'!$B$4:$M$97,12,FALSE)=\"OUT - 输出\",1,0))","v":1},{"$f":"IF(ISNA(VLOOKUP($A50,'GPIO Configuration'!$B$4:$N$97,13,FALSE)),0,IF(VLOOKUP($A50,'GPIO Configuration'!$B$4:$N$97,13,FALSE)=\"1 - 高电平\",1,0))","v":0},{"$f":"IF(ISNA(VLOOKUP($A50,'GPIO Configuration'!$B$4:$S$97,18,FALSE)),0,IF(VLOOKUP($A50,'GPIO Configuration'!$B$4:$S$97,18,FALSE)=\"1 - 使能\",1,0))","v":1},{"$f":"IF(ISNA(VLOOKUP($A50,'GPIO Configuration'!$B$4:$R$97,17,FALSE)),0,MATCH(VLOOKUP($A50,'GPIO Configuration'!$B$4:$R$97,17,FALSE),INDIRECT($A50&\"_InLv\"),0)-1)","v":0},{"$f":"IF(ISNA(VLOOKUP($A50,'GPIO Configuration'!$B$4:$T$97,19,FALSE)),0,IF(VLOOKUP($A50,'GPIO Configuration'!$B$4:$T$97,19,FALSE)=\"1 - 使能\",1,0))","v":0},{"$f":"IF(ISNA(VLOOKUP($A50,'GPIO Configuration'!$B$4:$Q$97,16,FALSE)),0,IF(VLOOKUP($A50,'GPIO Configuration'!$B$4:$Q$97,16,FALSE)=\"上拉\",2,IF(VLOOKUP($A50,'GPIO Configuration'!$B$4:$Q$97,16,FALSE)=\"下拉\",1,0)))","v":0},{"$f":"IF(ISNA(VLOOKUP($A50,'GPIO Configuration'!$B$4:$O$97,14,FALSE)),0,MATCH(VLOOKUP($A50,'GPIO Configuration'!$B$4:$O$97,14,FALSE),INDIRECT($A50&\"_Func\"),0)-1)","v":0},{"$f":"IF(ISNA(VLOOKUP($A50,'GPIO Configuration'!$B$4:$P$97,15,FALSE)),0,MATCH(VLOOKUP($A50,'GPIO Configuration'!$B$4:$P$97,15,FALSE),INDIRECT($A50&\"_OutDrv\"),0)-1)","v":0}]
["P1_16",1,16,"0x0030","GPIO_PODR1_POD16","GPIO_PIDR1_PID16",{"$f":"IF(ISNA(VLOOKUP($A51,'GPIO Configuration'!$B$4:$C$97,2,FALSE)),0,1)","v":1},{"$f":"IF(ISNA(VLOOKUP($A51,'GPIO Configuration'!$B$4:$C$97,2,FALSE)),0,IF(VLOOKUP($A51,'GPIO Configuration'!$B$4:$C$97,2,FALSE)=\"是\",1,0))","v":1},{"$f":"IF(ISNA(VLOOKUP($A51,'GPIO Configuration'!$B$4:$D$97,3,FALSE)),\"\",TRIM(VLOOKUP($A51,'GPIO Configuration'!$B$4:$D$97,3,FALSE)))","v":"PW1_OUT"},{"$f":"IF(ISNA(VLOOKUP($A51,'GPIO Configuration'!$B$4:$E$97,4,FALSE)),0,IF(VLOOKUP($A51,'GPIO Configuration'!$B$4:$E$97,4,FALSE)=\"OUT - 输出\",1,0))","v":1},{"$f":"IF(ISNA(VLOOKUP($A51,'GPIO Configuration'!$B$4:$F$97,5,FALSE)),0,IF(VLOOKUP($A51,'GPIO Configuration'!$B$4:$F$97,5,FALSE)=\"1 - 高电平\",1,0))","v":0},{"$f":"IF(ISNA(VLOOKUP($A51,'GPIO Configuration'!$B$4:$K$97,10,FALSE)),0,IF(VLOOKUP($A51,'GPIO Configuration'!$B$4:$K$97,10,FALSE)=\"1 - 使能\",1,0))","v":0},{"$f":"IF(ISNA(VLOOKUP($A51,'GPIO Configuration'!$B$4:$J$97,9,FALSE)),0,MATCH(VLOOKUP($A51,'GPIO Configuration'!$B$4:$J$97,9,FALSE),INDIRECT($A51&\"_InLv\"),0)-1)","v":0},{"$f":"IF(ISNA(VLOOKUP($A51,'GPIO Configuration'!$B$4:$L$97,11,FALSE)),0,IF(VLOOKUP($A51,'GPIO Configuration'!$B$4:$L$97,11,FALSE)=\"1 - 使能\",1,0))","v":1},{"$f":"IF(ISNA(VLOOKUP($A51,'GPIO Configuration'!$B$4:$I$97,8,FALSE)),0,IF(VLOOKUP($A51,'GPIO Configuration'!$B$4:$I$97,8,FALSE)=\"上拉\",2,IF(VLOOKUP($A51,'GPIO Configuration'!$B$4:$I$97,8,FALSE)=\"下拉\",1,0)))","v":0},{"$f":"IF(ISNA(VLOOKUP($A51,'GPIO Configuration'!$B$4:$G$97,6,FALSE)),0,MATCH(VLOOKUP($A51,'GPIO Configuration'!$B$4:$G$97,6,FALSE),INDIRECT($A51&\"_Func\"),0)-1)","v":6},{"$f":"IF(ISNA(VLOOKUP($A51,'GPIO Configuration'!$B$4:$H$97,7,FALSE)),0,MATCH(VLOOKUP($A51,'GPIO Configuration'!$B$4:$H$97,7,FALSE),INDIRECT($A51&\"_OutDrv\"),0)-1)","v":3},{"$f":"IF(ISNA(VLOOKUP($A51,'GPIO Configuration'!$B$4:$M$97,12,FALSE)),0,IF(VLOOKUP($A51,'GPIO Configuration'!$B$4:$M$97,12,FALSE)=\"OUT - 输出\",1,0))","v":1},{"$f":"IF(ISNA(VLOOKUP($A51,'GPIO Configuration'!$B$4:$N$97,13,FALSE)),0,IF(VLOOKUP($A51,'GPIO Configuration'!$B$4:$N$97,13,FALSE)=\"1 - 高电平\",1,0))","v":0},{"$f":"IF(ISNA(VLOOKUP($A51,'GPIO Configuration'!$B$4:$S$97,18,FALSE)),0,IF(VLOOKUP($A51,'GPIO Configuration'!$B$4:$S$97,18,FALSE)=\"1 - 使能\",1,0))","v":1},{"$f":"IF(ISNA(VLOOKUP($A51,'GPIO Configuration'!$B$4:$R$97,17,FALSE)),0,MATCH(VLOOKUP($A51,'GPIO Configuration'!$B$4:$R$97,17,FALSE),INDIRECT($A51&\"_InLv\"),0)-1)","v":0},{"$f":"IF(ISNA(VLOOKUP($A51,'GPIO Configuration'!$B$4:$T$97,19,FALSE)),0,IF(VLOOKUP($A51,'GPIO Configuration'!$B$4:$T$97,19,FALSE)=\"1 - 使能\",1,0))","v":0},{"$f":"IF(ISNA(VLOOKUP($A51,'GPIO Configuration'!$B$4:$Q$97,16,FALSE)),0,IF(VLOOKUP($A51,'GPIO Configuration'!$B$4:$Q$97,16,FALSE)=\"上拉\",2,IF(VLOOKUP($A51,'GPIO Configuration'!$B$4:$Q$97,16,FALSE)=\"下拉\",1,0)))","v":0},{"$f":"IF(ISNA(VLOOKUP($A51,'GPIO Configuration'!$B$4:$O$97,14,FALSE)),0,MATCH(VLOOKUP($A51,'GPIO Configuration'!$B$4:$O$97,14,FALSE),INDIRECT($A51&\"_Func\"),0)-1)","v":0},{"$f":"IF(ISNA(VLOOKUP($A51,'GPIO Configuration'!$B$4:$P$97,15,FALSE)),0,MATCH(VLOOKUP($A51,'GPIO Configuration'!$B$4:$P$97,15,FALSE),INDIRECT($A51&\"_OutDrv\"),0)-1)","v":0}]
["P1_17",1,17,"0x0031","GPIO_PODR1_POD17","GPIO_PIDR1_PID17",{"$f":"IF(ISNA(VLOOKUP($A52,'GPIO Configuration'!$B$4:$C$97,2,FALSE)),0,1)","v":1},{"$f":"IF(ISNA(VLOOKUP($A52,'GPIO Configuration'!$B$4:$C$97,2,FALSE)),0,IF(VLOOKUP($A52,'GPIO Configuration'!$B$4:$C$97,2,FALSE)=\"是\",1,0))","v":0},{"$f":"IF(ISNA(VLOOKUP($A52,'GPIO Configuration'!$B$4:$D$97,3,FALSE)),\"\",TRIM(VLOOKUP($A52,'GPIO Configuration'!$B$4:$D$97,3,FALSE)))","v":"KL_15_AD"},{"$f":"IF(ISNA(VLOOKUP($A52,'GPIO Configuration'!$B$4:$E$97,4,FALSE)),0,IF(VLOOKUP($A52,'GPIO Configuration'!$B$4:$E$97,4,FALSE)=\"OUT - 输出\",1,0))","v":0},{"$f":"IF(ISNA(VLOOKUP($A52,'GPIO Configuration'!$B$4:$F$97,5,FALSE)),0,IF(VLOOKUP($A52,'GPIO Configuration'!$B$4:$F$97,5,FALSE)=\"1 - 高电平\",1,0))","v":0},{"$f":"IF(ISNA(VLOOKUP($A52,'GPIO Configuration'!$B$4:$K$97,10,FALSE)),0,IF(VLOOKUP($A52,'GPIO Configuration'!$B$4:$K$97,10,FALSE)=\"1 - 使能\",1,0))","v":1},{"$f":"IF(ISNA(VLOOKUP($A52,'GPIO Configuration'!$B$4:$J$97,9,FALSE)),0,MATCH(VLOOKUP($A52,'GPIO Configuration'!$B$4:$J$97,9,FALSE),INDIRECT($A52&\"_InLv\"),0)-1)","v":0},{"$f":"IF(ISNA(VLOOKUP($A52,'GPIO Configuration'!$B$4:$L$97,11,FALSE)),0,IF(VLOOKUP($A52,'GPIO Configuration'!$B$4:$L$97,11,FALSE)=\"1 - 使能\",1,0))","v":0},{"$f":"IF(ISNA(VLOOKUP($A52,'GPIO Configuration'!$B$4:$I$97,8,FALSE)),0,IF(VLOOKUP($A52,'GPIO Configuration'!$B$4:$I$97,8,FALSE)=\"上拉\",2,IF(VLOOKUP($A52,'GPIO Configuration'!$B$4:$I$97,8,FALSE)=\"下拉\",1,0)))","v":0},{"$f":"IF(ISNA(VLOOKUP($A52,'GPIO Configuration'!$B$4:$G$97,6,FALSE)),0,MATCH(VLOOKUP($A52,'GPIO Configuration'!$B$4:$G$97,6,FALSE),INDIRECT($A52&\"_Func\"),0)-1)","v":0},{"$f":"IF(ISNA(VLOOKUP($A52,'GPIO Configuration'!$B$4:$H$97,7,FALSE)),0,MATCH(VLOOKUP($A52,'GPIO Configuration'!$B$4:$H$97,7,FALSE),INDIRECT($A52&\"_OutDrv\"),0)-1)","v":3},{"$f":"IF(ISNA(VLOOKUP($A52,'GPIO Configuration'!$B$4:$M$97,12,FALSE)),0,IF(VLOOKUP($A52,'GPIO Configuration'!$B$4:$M$97,12,FALSE)=\"OUT - 输出\",1,0))","v":0},{"$f":"IF(ISNA(VLOOKUP($A52,'GPIO Configuration'!$B$4:$N$97,13,FALSE)),0,IF(VLOOKUP($A52,'GPIO Configuration'!$B$4:$N$97,13,FALSE)=\"1 - 高电平\",1,0))","v":0},{"$f":"IF(ISNA(VLOOKUP($A52,'GPIO Configuration'!$B$4:$S$97,18,FALSE)),0,IF(VLOOKUP($A52,'GPIO Configuration'!$B$4:$S$97,18,FALSE)=\"1 - 使能\",1,0))","v":0},{"$f":"IF(ISNA(VLOOKUP($A52,'GPIO Configuration'!$B$4:$R$97,17,FALSE)),0,MATCH(VLOOKUP($A52,'GPIO Configuration'!$B$4:$R$97,17,FALSE),INDIRECT($A52&\"_InLv\"),0)-1)","v":0},{"$f":"IF(ISNA(VLOOKUP($A52,'GPIO Configuration'!$B$4:$T$97,19,FALSE)),0,IF(VLOOKUP($A52,'GPIO Configuration'!$B$4:$T$97,19,FALSE)=\"1 - 使能\",1,0))","v":1},{"$f":"IF(ISNA(VLOOKUP($A52,'GPIO Configuration'!$B$4:$Q$97,16,FALSE)),0,IF(VLOOKUP($A52,'GPIO Configuration'!$B$4:$Q$97,16,FALSE)=\"上拉\",2,IF(VLOOKUP($A52,'GPIO Configuration'!$B$4:$Q$97,16,FALSE)=\"下拉\",1,0)))","v":0},{"$f":"IF(ISNA(VLOOKUP($A52,'GPIO Configuration'!$B$4:$O$97,14,FALSE)),0,MATCH(VLOOKUP($A52,'GPIO Configuration'!$B$4:$O$97,14,FALSE),INDIRECT($A52&\"_Func\"),0)-1)","v":0},{"$f":"IF(ISNA(VLOOKUP($A52,'GPIO Configuration'!$B$4:$P$97,15,FALSE)),0,MATCH(VLOOKUP($A52,'GPIO Configuration'!$B$4:$P$97,15,FALSE),INDIRECT($A52&\"_OutDrv\"),0)-1)","v":0}]
["P1_18",1,18,"0x0032","GPIO_PODR1_POD18","GPIO_PIDR1_PID18",{"$f":"IF(ISNA(VLOOKUP($A53,'GPIO Configuration'!$B$4:$C$97,2,FALSE)),0,1)","v":1},{"$f":"IF(ISNA(VLOOKUP($A53,'GPIO Configuration'!$B$4:$C$97,2,FALSE)),0,IF(VLOOKUP($A53,'GPIO Configuration'!$B$4:$C$97,2,FALSE)=\"是\",1,0))","v":0},{"$f":"IF(ISNA(VLOOKUP($A53,'GPIO Configuration'!$B$4:$D$97,3,FALSE)),\"\",TRIM(VLOOKUP($A53,'GPIO Configuration'!$B$4:$D$97,3,FALSE)))","v":""},{"$f":"IF(ISNA(VLOOKUP($A53,'GPIO Configuration'!$B$4:$E$97,4,FALSE)),0,IF(VLOOKUP($A53,'GPIO Configuration'!$B$4:$E$97,4,FALSE)=\"OUT - 输出\",1,0))","v":1},{"$f":"IF(ISNA(VLOOKUP($A53,'GPIO Configuration'!$B$4:$F$97,5,FALSE)),0,IF(VLOOKUP($A53,'GPIO Configuration'!$B$4:$F$97,5,FALSE)=\"1 - 高电平\",1,0))","v":0},{"$f":"IF(ISNA(VLOOKUP($A53,'GPIO Configuration'!$B$4:$K$97,10,FALSE)),0,IF(VLOOKUP($A53,'GPIO Configuration'!$B$4:$K$97,10,FALSE)=\"1 - 使能\",1,0))","v":0},{"$f":"IF(ISNA(VLOOKUP($A53,'GPIO Configuration'!$B$4:$J$97,9,FALSE)),0,MATCH(VLOOKUP($A53,'GPIO Configuration'!$B$4:$J$97,9,FALSE),INDIRECT($A53&\"_InLv\"),0)-1)","v":0},{"$f":"IF(ISNA(VLOOKUP($A53,'GPIO Configuration'!$B$4:$L$97,11,FALSE)),0,IF(VLOOKUP($A53,'GPIO Configuration'!$B$4:$L$97,11,FALSE)=\"1 - 使能\",1,0))","v":1},{"$f":"IF(ISNA(VLOOKUP($A53,'GPIO Configuration'!$B$4:$I$97,8,FALSE)),0,IF(VLOOKUP($A53,'GPIO Configuration'!$B$4:$I$97,8,FALSE)=\"上拉\",2,IF(VLOOKUP($A53,'GPIO Configuration'!$B$4:$I$97,8,FALSE)=\"下拉\",1,0)))","v":0},{"$f":"IF(ISNA(VLOOKUP($A53,'GPIO Configuration'!$B$4:$G$97,6,FALSE)),0,MATCH(VLOOKUP($A53,'GPIO Configuration'!$B$4:$G$97,6,FALSE),INDIRECT($A53&\"_Func\"),0)-1)","v":0},{"$f":"IF(ISNA(VLOOKUP($A53,'GPIO Configuration'!$B$4:$H$97,7,FALSE)),0,MATCH(VLOOKUP($A53,'GPIO Configuration'!$B$4:$H$97,7,FALSE),INDIRECT($A53&\"_OutDrv\"),0)-1)","v":3},{"$f":"IF(ISNA(VLOOKUP($A53,'GPIO Configuration'!$B$4:$M$97,12,FALSE)),0,IF(VLOOKUP($A53,'GPIO Configuration'!$B$4:$M$97,12,FALSE)=\"OUT - 输出\",1,0))","v":0},{"$f":"IF(ISNA(VLOOKUP($A53,'GPIO Configuration'!$B$4:$N$97,13,FALSE)),0,IF(VLOOKUP($A53,'GPIO Configuration'!$B$4:$N$97,13,FALSE)=\"1 - 高电平\",1,0))","v":0},{"$f":"IF(ISNA(VLOOKUP($A53,'GPIO Configuration'!$B$4:$S$97,18,FALSE)),0,IF(VLOOKUP($A53,'GPIO Configuration'!$B$4:$S$97,18,FALSE)=\"1 - 使能\",1,0))","v":0},{"$f":"IF(ISNA(VLOOKUP($A53,'GPIO Configuration'!$B$4:$R$97,17,FALSE)),0,MATCH(VLOOKUP($A53,'GPIO Configuration'!$B$4:$R$97,17,FALSE),INDIRECT($A53&\"_InLv\"),0)-1)","v":0},{"$f":"IF(ISNA(VLOOKUP($A53,'GPIO Configuration'!$B$4:$T$97,19,FALSE)),0,IF(VLOOKUP($A53,'GPIO Configuration'!$B$4:$T$97,19,FALSE)=\"1 - 使能\",1,0))","v":1},{"$f":"IF(ISNA(VLOOKUP($A53,'GPIO Configuration'!$B$4:$Q$97,16,FALSE)),0,IF(VLOOKUP($A53,'GPIO Configuration'!$B$4:$Q$97,16,FALSE)=\"上拉\",2,IF(VLOOKUP($A53,'GPIO Configuration'!$B$4:$Q$97,16,FALSE)=\"下拉\",1,0)))","v":0},{"$f":"IF(ISNA(VLOOKUP($A53,'GPIO Configuration'!$B$4:$O$97,14,FALSE)),0,MATCH(VLOOKUP($A53,'GPIO Configuration'!$B$4:$O$97,14,FALSE),INDIRECT($A53&\"_Func\"),0)-1)","v":0},{"$f":"IF(ISNA(VLOOKUP($A53,'GPIO Configuration'!$B$4:$P$97,15,FALSE)),0,MATCH(VLOOKUP($A53,'GPIO Configuration'!$B$4:$P$97,15,FALSE),INDIRECT($A53&\"_OutDrv\"),0)-1)","v":0}]
["P1_19",1,19,"0x0033","GPIO_PODR1_POD19","GPIO_PIDR1_PID19",{"$f":"IF(ISNA(VLOOKUP($A54,'GPIO Configuration'!$B$4:$C$97,2,FALSE)),0,1)","v":1},{"$f":"IF(ISNA(VLOOKUP($A54,'GPIO Configuration'!$B$4:$C$97,2,FALSE)),0,IF(VLOOKUP($A54,'GPIO Configuration'!$B$4:$C$97,2,FALSE)=\"是\",1,0))","v":1},{"$f":"IF(ISNA(VLOOKUP($A54,'GPIO Configuration'!$B$4:$D$97,3,FALSE)),\"\",TRIM(VLOOKUP($A54,'GPIO Configuration'!$B$4:$D$97,3,FALSE)))","v":"Line_In_TurnLeft"},{"$f":"IF(ISNA(VLOOKUP($A54,'GPIO Configuration'!$B$4:$E$97,4,FALSE)),0,IF(VLOOKUP($A54,'GPIO Configuration'!$B$4:$E$97,4,FALSE)=\"OUT - 输出\",1,0))","v":0},{"$f":"IF(ISNA(VLOOKUP($A54,'GPIO Configuration'!$B$4:$F$97,5,FALSE)),0,IF(VLOOKUP($A54,'GPIO Configuration'!$B$4:$F$97,5,FALSE)=\"1 - 高电平\",1,0))","v":0},{"$f":"IF(ISNA(VLOOKUP($A54,'GPIO Configuration'!$B$4:$K$97,10,FALSE)),0,IF(VLOOKUP($A54,'GPIO Configuration'!$B$4:$K$97,10,FALSE)=\"1 - 使能\",1,0))","v":1},{"$f":"IF(ISNA(VLOOKUP($A54,'GPIO Configuration'!$B$4:$J$97,9,FALSE)),0,MATCH(VLOOKUP($A54,'GPIO Configuration'!$B$4:$J$97,9,FALSE),INDIRECT($A54&\"_InLv\"),0)-1)","v":0},{"$f":"IF(ISNA(VLOOKUP($A54,'GPIO Configuration'!$B$4:$L$97,11,FALSE)),0,IF(VLOOKUP($A54,'GPIO Configuration'!$B$4:$L$97,11,FALSE)=\"1 - 使能\",1,0))","v":1},{"$f":"IF(ISNA(VLOOKUP($A54,'GPIO Configuration'!$B$4:$I$97,8,FALSE)),0,IF(VLOOKUP($A54,'GPIO Configuration'!$B$4:$I$97,8,FALSE)=\"上拉\",2,IF(VLOOKUP($A54,'GPIO Configuration'!$B$4:$I$97,8,FALSE)=\"下拉\",1,0)))","v":0},{"$f":"IF(ISNA(VLOOKUP($A54,'GPIO Configuration'!$B$4:$G$97,6,FALSE)),0,MATCH(VLOOKUP($A54,'GPIO Configuration'!$B$4:$G$97,6,FALSE),INDIRECT($A54&\"_Func\"),0)-1)","v":0},{"$f":"IF(ISNA(VLOOKUP($A54,'GPIO Configuration'!$B$4:$H$97,7,FALSE)),0,MATCH(VLOOKUP($A54,'GPIO Configuration'!$B$4:$H$97,7,FALSE),INDIRECT($A54&\"_OutDrv\"),0)-1)","v":2},{"$f":"IF(ISNA(VLOOKUP($A54,'GPIO Configuration'!$B$4:$M$97,12,FALSE)),0,IF(VLOOKUP($A54,'GPIO Configuration'!$B$4:$M$97,12,FALSE)=\"OUT - 输出\",1,0))","v":0},{"$f":"IF(ISNA(VLOOKUP($A54,'GPIO Configuration'!$B$4:$N$97,13,FALSE)),0,IF(VLOOKUP($A54,'GPIO Configuration'!$B$4:$N$97,13,FALSE)=\"1 - 高电平\",1,0))","v":0},{"$f":"IF(ISNA(VLOOKUP($A54,'GPIO Configuration'!$B$4:$S$97,18,FALSE)),0,IF(VLOOKUP($A54,'GPIO Configuration'!$B$4:$S$97,18,FALSE)=\"1 - 使能\",1,0))","v":1},{"$f":"IF(ISNA(VLOOKUP($A54,'GPIO Configuration'!$B$4:$R$97,17,FALSE)),0,MATCH(VLOOKUP($A54,'GPIO Configuration'!$B$4:$R$97,17,FALSE),INDIRECT($A54&\"_InLv\"),0)-1)","v":0},{"$f":"IF(ISNA(VLOOKUP($A54,'GPIO Configuration'!$B$4:$T$97,19,FALSE)),0,IF(VLOOKUP($A54,'GPIO Configuration'!$B$4:$T$97,19,FALSE)=\"1 - 使能\",1,0))","v":1},{"$f":"IF(ISNA(VLOOKUP($A54,'GPIO Configuration'!$B$4:$Q$97,16,FALSE)),0,IF(VLOOKUP($A54,'GPIO Configuration'!$B$4:$Q$97,16,FALSE)=\"上拉\",2,IF(VLOOKUP($A54,'GPIO Configuration'!$B$4:$Q$97,16,FALSE)=\"下拉\",1,0)))","v":0},{"$f":"IF(ISNA(VLOOKUP($A54,'GPIO Configuration'!$B$4:$O$97,14,FALSE)),0,MATCH(VLOOKUP($A54,'GPIO Configuration'!$B$4:$O$97,14,FALSE),INDIRECT($A54&\"_Func\"),0)-1)","v":0},{"$f":"IF(ISNA(VLOOKUP($A54,'GPIO Configuration'!$B$4:$P$97,15,FALSE)),0,MATCH(VLOOKUP($A54,'GPIO Configuration'!$B$4:$P$97,15,FALSE),INDIRECT($A54&\"_OutDrv\"),0)-1)","v":0}]
["P1_20",1,20,"0x0034","GPIO_PODR1_POD20","GPIO_PIDR1_PID20",{"$f":"IF(ISNA(VLOOKUP($A55,'GPIO Configuration'!$B$4:$C$97,2,FALSE)),0,1)","v":1},{"$f":"IF(ISNA(VLOOKUP($A55,'GPIO Configuration'!$B$4:$C$97,2,FALSE)),0,IF(VLOOKUP($A55,'GPIO Configuration'!$B$4:$C$97,2,FALSE)=\"是\",1,0))","v":0},{"$f":"IF(ISNA(VLOOKUP($A55,'GPIO Configuration'!$B$4:$D$97,3,FALSE)),\"\",TRIM(VLOOKUP($A55,'GPIO Configuration'!$B$4:$D$97,3,FALSE)))","v":""},{"$f":"IF(ISNA(VLOOKUP($A55,'GPIO Configuration'!$B$4:$E$97,4,FALSE)),0,IF(VLOOKUP($A55,'GPIO Configuration'!$B$4:$E$97,4,FALSE)=\"OUT - 输出\",1,0))","v":1},{"$f":"IF(ISNA(VLOOKUP($A55,'GPIO Configuration'!$B$4:$F$97,5,FALSE)),0,IF(VLOOKUP($A55,'GPIO Configuration'!$B$4:$F$97,5,FALSE)=\"1 - 高电平\",1,0))","v":0},{"$f":"IF(ISNA(VLOOKUP($A55,'GPIO Configuration'!$B$4:$K$97,10,FALSE)),0,IF(VLOOKUP($A55,'GPIO Configuration'!$B$4:$K$97,10,FALSE)=\"1 - 使能\",1,0))","v":0},{"$f":"IF(ISNA(VLOOKUP($A55,'GPIO Configuration'!$B$4:$J$97,9,FALSE)),0,MATCH(VLOOKUP($A55,'GPIO Configuration'!$B$4:$J$97,9,FALSE),INDIRECT($A55&\"_InLv\"),0)-1)","v":0},{"$f":"IF(ISNA(VLOOKUP($A55,'GPIO Configuration'!$B$4:$L$97,11,FALSE)),0,IF(VLOOKUP($A55,'GPIO Configuration'!$B$4:$L$97,11,FALSE)=\"1 - 使能\",1,0))","v":1},{"$f":"IF(ISNA(VLOOKUP($A55,'GPIO Configuration'!$B$4:$I$97,8,FALSE)),0,IF(VLOOKUP($A55,'GPIO Configuration'!$B$4:$I$97,8,FALSE)=\"上拉\",2,IF(VLOOKUP($A55,'GPIO Configuration'!$B$4:$I$97,8,FALSE)=\"下拉\",1,0)))","v":0},{"$f":"IF(ISNA(VLOOKUP($A55,'GPIO Configuration'!$B$4:$G$97,6,FALSE)),0,MATCH(VLOOKUP($A55,'GPIO Configuration'!$B$4:$G$97,6,FALSE),INDIRECT($A55&\"_Func\"),0)-1)","v":0},{"$f":"IF(ISNA(VLOOKUP($A55,'GPIO Configuration'!$B$4:$H$97,7,FALSE)),0,MATCH(VLOOKUP($A55,'GPIO Configuration'!$B$4:$H$97,7,FALSE),INDIRECT($A55&\"_OutDrv\"),0)-1)","v":3},{"$f":"IF(ISNA(VLOOKUP($A55,'GPIO Configuration'!$B$4:$M$97,12,FALSE)),0,IF(VLOOKUP($A55,'GPIO Configuration'!$B$4:$M$97,12,FALSE)=\"OUT - 输出\",1,0))","v":0},{"$f":"IF(ISNA(VLOOKUP($A55,'GPIO Configuration'!$B$4:$N$97,13,FALSE)),0,IF(VLOOKUP($A55,'GPIO Configuration'!$B$4:$N$97,13,FALSE)=\"1 - 高电平\",1,0))","v":0},{"$f":"IF(ISNA(VLOOKUP($A55,'GPIO Configuration'!$B$4:$S$97,18,FALSE)),0,IF(VLOOKUP($A55,'GPIO Configuration'!$B$4:$S$97,18,FALSE)=\"1 - 使能\",1,0))","v":0},{"$f":"IF(ISNA(VLOOKUP($A55,'GPIO Configuration'!$B$4:$R$97,17,FALSE)),0,MATCH(VLOOKUP($A55,'GPIO Configuration'!$B$4:$R$97,17,FALSE),INDIRECT($A55&\"_InLv\"),0)-1)","v":0},{"$f":"IF(ISNA(VLOOKUP($A55,'GPIO Configuration'!$B$4:$T$97,19,FALSE)),0,IF(VLOOKUP($A55,'GPIO Configuration'!$B$4:$T$97,19,FALSE)=\"1 - 使能\",1,0))","v":1},{"$f":"IF(ISNA(VLOOKUP($A55,'GPIO Configuration'!$B$4:$Q$97,16,FALSE)),0,IF(VLOOKUP($A55,'GPIO Configuration'!$B$4:$Q$97,16,FALSE)=\"上拉\",2,IF(VLOOKUP($A55,'GPIO Configuration'!$B$4:$Q$97,16,FALSE)=\"下拉\",1,0)))","v":0},{"$f":"IF(ISNA(VLOOKUP($A55,'GPIO Configuration'!$B$4:$O$97,14,FALSE)),0,MATCH(VLOOKUP($A55,'GPIO Configuration'!$B$4:$O$97,14,FALSE),INDIRECT($A55&\"_Func\"),0)-1)","v":0},{"$f":"IF(ISNA(VLOOKUP($A55,'GPIO Configuration'!$B$4:$P$97,15,FALSE)),0,MATCH(VLOOKUP($A55,'GPIO Configuration'!$B$4:$P$97,15,FALSE),INDIRECT($A55&\"_OutDrv\"),0)-1)","v":0}]
["P1_21",1,21,"0x0035","GPIO_PODR1_POD21","GPIO_PIDR1_PID21",{"$f":"IF(ISNA(VLOOKUP($A56,'GPIO Configuration'!$B$4:$C$97,2,FALSE)),0,1)","v":1},{"$f":"IF(ISNA(VLOOKUP($A56,'GPIO Configuration'!$B$4:$C$97,2,FALSE)),0,IF(VLOOKUP($A56,'GPIO Configuration'!$B$4:$C$97,2,FALSE)=\"是\",1,0))","v":0},{"$f":"IF(ISNA(VLOOKUP($A56,'GPIO Configuration'!$B$4:$D$97,3,FALSE)),\"\",TRIM(VLOOKUP($A56,'GPIO Configuration'!$B$4:$D$97,3,FALSE)))","v":""},{"$f":"IF(ISNA(VLOOKUP($A56,'GPIO Configuration'!$B$4:$E$97,4,FALSE)),0,IF(VLOOKUP($A56,'GPIO Configuration'!$B$4:$E$97,4,FALSE)=\"OUT - 输出\",1,0))","v":1},{"$f":"IF(ISNA(VLOOKUP($A56,'GPIO Configuration'!$B$4:$F$97,5,FALSE)),0,IF(VLOOKUP($A56,'GPIO Configuration'!$B$4:$F$97,5,FALSE)=\"1 - 高电平\",1,0))","v":0},{"$f":"IF(ISNA(VLOOKUP($A56,'GPIO Configuration'!$B$4:$K$97,10,FALSE)),0,IF(VLOOKUP($A56,'GPIO Configuration'!$B$4:$K$97,10,FALSE)=\"1 - 使能\",1,0))","v":0},{"$f":"IF(ISNA(VLOOKUP($A56,'GPIO Configuration'!$B$4:$J$97,9,FALSE)),0,MATCH(VLOOKUP($A56,'GPIO Configuration'!$B$4:$J$97,9,FALSE),INDIRECT($A56&\"_InLv\"),0)-1)","v":0},{"$f":"IF(ISNA(VLOOKUP($A56,'GPIO Configuration'!$B$4:$L$97,11,FALSE)),0,IF(VLOOKUP($A56,'GPIO Configuration'!$B$4:$L$97,11,FALSE)=\"1 - 使能\",1,0))","v":1},{"$f":"IF(ISNA(VLOOKUP($A56,'GPIO Configuration'!$B$4:$I$97,8,FALSE)),0,IF(VLOOKUP($A56,'GPIO Configuration'!$B$4:$I$97,8,FALSE)=\"上拉\",2,IF(VLOOKUP($A56,'GPIO Configuration'!$B$4:$I$97,8,FALSE)=\"下拉\",1,0)))","v":0},{"$f":"IF(ISNA(VLOOKUP($A56,'GPIO Configuration'!$B$4:$G$97,6,FALSE)),0,MATCH(VLOOKUP($A56,'GPIO Configuration'!$B$4:$G$97,6,FALSE),INDIRECT($A56&\"_Func\"),0)-1)","v":0},{"$f":"IF(ISNA(VLOOKUP($A56,'GPIO Configuration'!$B$4:$H$97,7,FALSE)),0,MATCH(VLOOKUP($A56,'GPIO Configuration'!$B$4:$H$97,7,FALSE),INDIRECT($A56&\"_OutDrv\"),0)-1)","v":3},{"$f":"IF(ISNA(VLOOKUP($A56,'GPIO Configuration'!$B$4:$M$97,12,FALSE)),0,IF(VLOOKUP($A56,'GPIO Configuration'!$B$4:$M$97,12,FALSE)=\"OUT - 输出\",1,0))","v":0},{"$f":"IF(ISNA(VLOOKUP($A56,'GPIO Configuration'!$B$4:$N$97,13,FALSE)),0,IF(VLOOKUP($A56,'GPIO Configuration'!$B$4:$N$97,13,FALSE)=\"1 - 高电平\",1,0))","v":0},{"$f":"IF(ISNA(VLOOKUP($A56,'GPIO Configuration'!$B$4:$S$97,18,FALSE)),0,IF(VLOOKUP($A56,'GPIO Configuration'!$B$4:$S$97,18,FALSE)=\"1 - 使能\",1,0))","v":0},{"$f":"IF(ISNA(VLOOKUP($A56,'GPIO Configuration'!$B$4:$R$97,17,FALSE)),0,MATCH(VLOOKUP($A56,'GPIO Configuration'!$B$4:$R$97,17,FALSE),INDIRECT($A56&\"_InLv\"),0)-1)","v":0},{"$f":"IF(ISNA(VLOOKUP($A56,'GPIO Configuration'!$B$4:$T$97,19,FALSE)),0,IF(VLOOKUP($A56,'GPIO Configuration'!$B$4:$T$97,19,FALSE)=\"1 - 使能\",1,0))","v":1},{"$f":"IF(ISNA(VLOOKUP($A56,'GPIO Configuration'!$B$4:$Q$97,16,FALSE)),0,IF(VLOOKUP($A56,'GPIO Configuration'!$B$4:$Q$97,16,FALSE)=\"上拉\",2,IF(VLOOKUP($A56,'GPIO Configuration'!$B$4:$Q$97,16,FALSE)=\"下拉\",1,0)))","v":0},{"$f":"IF(ISNA(VLOOKUP($A56,'GPIO Configuration'!$B$4:$O$97,14,FALSE)),0,MATCH(VLOOKUP($A56,'GPIO Configuration'!$B$4:$O$97,14,FALSE),INDIRECT($A56&\"_Func\"),0)-1)","v":0},{"$f":"IF(ISNA(VLOOKUP($A56,'GPIO Configuration'!$B$4:$P$97,15,FALSE)),0,MATCH(VLOOKUP($A56,'GPIO Configuration'!$B$4:$P$97,15,FALSE),INDIRECT($A56&\"_OutDrv\"),0)-1)","v":0}]
["P1_22",1,22,"0x0036","GPIO_PODR1_POD22","GPIO_PIDR1_PID22",{"$f":"IF(ISNA(VLOOKUP($A57,'GPIO Configuration'!$B$4:$C$97,2,FALSE)),0,1)","v":1},{"$f":"IF(ISNA(VLOOKUP($A57,'GPIO Configuration'!$B$4:$C$97,2,FALSE)),0,IF(VLOOKUP($A57,'GPIO Configuration'!$B$4:$C$97,2,FALSE)=\"是\",1,0))","v":0},{"$f":"IF(ISNA(VLOOKUP($A57,'GPIO Configuration'!$B$4:$D$97,3,FALSE)),\"\",TRIM(VLOOKUP($A57,'GPIO Configuration'!$B$4:$D$97,3,FALSE)))","v":""},{"$f":"IF(ISNA(VLOOKUP($A57,'GPIO Configuration'!$B$4:$E$97,4,FALSE)),0,IF(VLOOKUP($A57,'GPIO Configuration'!$B$4:$E$97,4,FALSE)=\"OUT - 输出\",1,0))","v":1},{"$f":"IF(ISNA(VLOOKUP($A57,'GPIO Configuration'!$B$4:$F$97,5,FALSE)),0,IF(VLOOKUP($A57,'GPIO Configuration'!$B$4:$F$97,5,FALSE)=\"1 - 高电平\",1,0))","v":0},{"$f":"IF(ISNA(VLOOKUP($A57,'GPIO Configuration'!$B$4:$K$97,10,FALSE)),0,IF(VLOOKUP($A57,'GPIO Configuration'!$B$4:$K$97,10,FALSE)=\"1 - 使能\",1,0))","v":0},{"$f":"IF(ISNA(VLOOKUP($A57,'GPIO Configuration'!$B$4:$J$97,9,FALSE)),0,MATCH(VLOOKUP($A57,'GPIO Configuration'!$B$4:$J$97,9,FALSE),INDIRECT($A57&\"_InLv\"),0)-1)","v":0},{"$f":"IF(ISNA(VLOOKUP($A57,'GPIO Configuration'!$B$4:$L$97,11,FALSE)),0,IF(VLOOKUP($A57,'GPIO Configuration'!$B$4:$L$97,11,FALSE)=\"1 - 使能\",1,0))","v":1},{"$f":"IF(ISNA(VLOOKUP($A57,'GPIO Configuration'!$B$4:$I$97,8,FALSE)),0,IF(VLOOKUP($A57,'GPIO Configuration'!$B$4:$I$97,8,FALSE)=\"上拉\",2,IF(VLOOKUP($A57,'GPIO Configuration'!$B$4:$I$97,8,FALSE)=\"下拉\",1,0)))","v":0},{"$f":"IF(ISNA(VLOOKUP($A57,'GPIO Configuration'!$B$4:$G$97,6,FALSE)),0,MATCH(VLOOKUP($A57,'GPIO Configuration'!$B$4:$G$97,6,FALSE),INDIRECT($A57&\"_Func\"),0)-1)","v":0},{"$f":"IF(ISNA(VLOOKUP($A57,'GPIO Configuration'!$B$4:$H$97,7,FALSE)),0,MATCH(VLOOKUP($A57,'GPIO Configuration'!$B$4:$H$97,7,FALSE),INDIRECT($A57&\"_OutDrv\"),0)-1)","v":3},{"$f":"IF(ISNA(VLOOKUP($A57,'GPIO Configuration'!$B$4:$M$97,12,FALSE)),0,IF(VLOOKUP($A57,'GPIO Configuration'!$B$4:$M$97,12,FALSE)=\"OUT - 输出\",1,0))","v":0},{"$f":"IF(ISNA(VLOOKUP($A57,'GPIO Configuration'!$B$4:$N$97,13,FALSE)),0,IF(VLOOKUP($A57,'GPIO Configuration'!$B$4:$N$97,13,FALSE)=\"1 - 高电平\",1,0))","v":0},{"$f":"IF(ISNA(VLOOKUP($A57,'GPIO Configuration'!$B$4:$S$97,18,FALSE)),0,IF(VLOOKUP($A57,'GPIO Configuration'!$B$4:$S$97,18,FALSE)=\"1 - 使能\",1,0))","v":0},{"$f":"IF(ISNA(VLOOKUP($A57,'GPIO Configuration'!$B$4:$R$97,17,FALSE)),0,MATCH(VLOOKUP($A57,'GPIO Configuration'!$B$4:$R$97,17,FALSE),INDIRECT($A57&\"_InLv\"),0)-1)","v":0},{"$f":"IF(ISNA(VLOOKUP($A57,'GPIO Configuration'!$B$4:$T$97,19,FALSE)),0,IF(VLOOKUP($A57,'GPIO Configuration'!$B$4:$T$97,19,FALSE)=\"1 - 使能\",1,0))","v":1},{"$f":"IF(ISNA(VLOOKUP($A57,'GPIO Configuration'!$B$4:$Q$97,16,FALSE)),0,IF(VLOOKUP($A57,'GPIO Configuration'!$B$4:$Q$97,16,FALSE)=\"上拉\",2,IF(VLOOKUP($A57,'GPIO Configuration'!$B$4:$Q$97,16,FALSE)=\"下拉\",1,0)))","v":0},{"$f":"IF(ISNA(VLOOKUP($A57,'GPIO Configuration'!$B$4:$O$97,14,FALSE)),0,MATCH(VLOOKUP($A57,'GPIO Configuration'!$B$4:$O$97,14,FALSE),INDIRECT($A57&\"_Func\"),0)-1)","v":0},{"$f":"IF(ISNA(VLOOKUP($A57,'GPIO Configuration'!$B$4:$P$97,15,FALSE)),0,MATCH(VLOOKUP($A57,'GPIO Configuration'!$B$4:$P$97,15,FALSE),INDIRECT($A57&\"_OutDrv\"),0)-1)","v":0}]
["P1_23",1,23,"0x0037","GPIO_PODR1_POD23","GPIO_PIDR1_PID23",{"$f":"IF(ISNA(VLOOKUP($A58,'GPIO Configuration'!$B$4:$C$97,2,FALSE)),0,1)","v":1},{"$f":"IF(ISNA(VLOOKUP($A58,'GPIO Configuration'!$B$4:$C$97,2,FALSE)),0,IF(VLOOKUP($A58,'GPIO Configuration'!$B$4:$C$97,2,FALSE)=\"是\",1,0))","v":1},{"$f":"IF(ISNA(VLOOKUP($A58,'GPIO Configuration'!$B$4:$D$97,3,FALSE)),\"\",TRIM(VLOOKUP($A58,'GPIO Configuration'!$B$4:$D$97,3,FALSE)))","v":"CSB1_OUT"},{"$f":"IF(ISNA(VLOOKUP($A58,'GPIO Configuration'!$B$4:$E$97,4,FALSE)),0,IF(VLOOKUP($A58,'GPIO Configuration'!$B$4:$E$97,4,FALSE)=\"OUT - 输出\",1,0))","v":1},{"$f":"IF(ISNA(VLOOKUP($A58,'GPIO Configuration'!$B$4:$F$97,5,FALSE)),0,IF(VLOOKUP($A58,'GPIO Configuration'!$B$4:$F$97,5,FALSE)=\"1 - 高电平\",1,0))","v":0},{"$f":"IF(ISNA(VLOOKUP($A58,'GPIO Configuration'!$B$4:$K$97,10,FALSE)),0,IF(VLOOKUP($A58,'GPIO Configuration'!$B$4:$K$97,10,FALSE)=\"1 - 使能\",1,0))","v":0},{"$f":"IF(ISNA(VLOOKUP($A58,'GPIO Configuration'!$B$4:$J$97,9,FALSE)),0,MATCH(VLOOKUP($A58,'GPIO Configuration'!$B$4:$J$97,9,FALSE),INDIRECT($A58&\"_InLv\"),0)-1)","v":0},{"$f":"IF(ISNA(VLOOKUP($A58,'GPIO Configuration'!$B$4:$L$97,11,FALSE)),0,IF(VLOOKUP($A58,'GPIO Configuration'!$B$4:$L$97,11,FALSE)=\"1 - 使能\",1,0))","v":1},{"$f":"IF(ISNA(VLOOKUP($A58,'GPIO Configuration'!$B$4:$I$97,8,FALSE)),0,IF(VLOOKUP($A58,'GPIO Configuration'!$B$4:$I$97,8,FALSE)=\"上拉\",2,IF(VLOOKUP($A58,'GPIO Configuration'!$B$4:$I$97,8,FALSE)=\"下拉\",1,0)))","v":0},{"$f":"IF(ISNA(VLOOKUP($A58,'GPIO Configuration'!$B$4:$G$97,6,FALSE)),0,MATCH(VLOOKUP($A58,'GPIO Configuration'!$B$4:$G$97,6,FALSE),INDIRECT($A58&\"_Func\"),0)-1)","v":0},{"$f":"IF(ISNA(VLOOKUP($A58,'GPIO Configuration'!$B$4:$H$97,7,FALSE)),0,MATCH(VLOOKUP($A58,'GPIO Configuration'!$B$4:$H$97,7,FALSE),INDIRECT($A58&\"_OutDrv\"),0)-1)","v":3},{"$f":"IF(ISNA(VLOOKUP($A58,'GPIO Configuration'!$B$4:$M$97,12,FALSE)),0,IF(VLOOKUP($A58,'GPIO Configuration'!$B$4:$M$97,12,FALSE)=\"OUT - 输出\",1,0))","v":0},{"$f":"IF(ISNA(VLOOKUP($A58,'GPIO Configuration'!$B$4:$N$97,13,FALSE)),0,IF(VLOOKUP($A58,'GPIO Configuration'!$B$4:$N$97,13,FALSE)=\"1 - 高电平\",1,0))","v":0},{"$f":"IF(ISNA(VLOOKUP($A58,'GPIO Configuration'!$B$4:$S$97,18,FALSE)),0,IF(VLOOKUP($A58,'GPIO Configuration'!$B$4:$S$97,18,FALSE)=\"1 - 使能\",1,0))","v":0},{"$f":"IF(ISNA(VLOOKUP($A58,'GPIO Configuration'!$B$4:$R$97,17,FALSE)),0,MATCH(VLOOKUP($A58,'GPIO Configuration'!$B$4:$R$97,17,FALSE),INDIRECT($A58&\"_InLv\"),0)-1)","v":0},{"$f":"IF(ISNA(VLOOKUP($A58,'GPIO Configuration'!$B$4:$T$97,19,FALSE)),0,IF(VLOOKUP($A58,'GPIO Configuration'!$B$4:$T$97,19,FALSE)=\"1 - 使能\",1,0))","v":1},{"$f":"IF(ISNA(VLOOKUP($A58,'GPIO Configuration'!$B$4:$Q$97,16,FALSE)),0,IF(VLOOKUP($A58,'GPIO Configuration'!$B$4:$Q$97,16,FALSE)=\"上拉\",2,IF(VLOOKUP($A58,'GPIO Configuration'!$B$4:$Q$97,16,FALSE)=\"下拉\",1,0)))","v":0},{"$f":"IF(ISNA(VLOOKUP($A58,'GPIO Configuration'!$B$4:$O$97,14,FALSE)),0,MATCH(VLOOKUP($A58,'GPIO Configuration'!$B$4:$O$97,14,FALSE),INDIRECT($A58&\"_Func\"),0)-1)","v":0},{"$f":"IF(ISNA(VLOOKUP($A58,'GPIO Configuration'!$B$4:$P$97,15,FALSE)),0,MATCH(VLOOKUP($A58,'GPIO Configuration'!$B$4:$P$97,15,FALSE),INDIRECT($A58&\"_OutDrv\"),0)-1)","v":0}]
["P1_24",1,24,"0x0038","GPIO_PODR1_POD24","GPIO_PIDR1_PID24",{"$f":"IF(ISNA(VLOOKUP($A59,'GPIO Configuration'!$B$4:$C$97,2,FALSE)),0,1)","v":1},{"$f":"IF(ISNA(VLOOKUP($A59,'GPIO Configuration'!$B$4:$C$97,2,FALSE)),0,IF(VLOOKUP($A59,'GPIO Configuration'!$B$4:$C$97,2,FALSE)=\"是\",1,0))","v":1},{"$f":"IF(ISNA(VLOOKUP($A59,'GPIO Configuration'!$B$4:$D$97,3,FALSE)),\"\",TRIM(VLOOKUP($A59,'GPIO Configuration'!$B$4:$D$97,3,FALSE)))","v":"SCL1_OUT"},{"$f":"IF(ISNA(VLOOKUP($A59,'GPIO Configuration'!$B$4:$E$97,4,FALSE)),0,IF(VLOOKUP($A59,'GPIO Configuration'!$B$4:$E$97,4,FALSE)=\"OUT - 输出\",1,0))","v":1},{"$f":"IF(ISNA(VLOOKUP($A59,'GPIO Configuration'!$B$4:$F$97,5,FALSE)),0,IF(VLOOKUP($A59,'GPIO Configuration'!$B$4:$F$97,5,FALSE)=\"1 - 高电平\",1,0))","v":0},{"$f":"IF(ISNA(VLOOKUP($A59,'GPIO Configuration'!$B$4:$K$97,10,FALSE)),0,IF(VLOOKUP($A59,'GPIO Configuration'!$B$4:$K$97,10,FALSE)=\"1 - 使能\",1,0))","v":0},{"$f":"IF(ISNA(VLOOKUP($A59,'GPIO Configuration'!$B$4:$J$97,9,FALSE)),0,MATCH(VLOOKUP($A59,'GPIO Configuration'!$B$4:$J$97,9,FALSE),INDIRECT($A59&\"_InLv\"),0)-1)","v":0},{"$f":"IF(ISNA(VLOOKUP($A59,'GPIO Configuration'!$B$4:$L$97,11,FALSE)),0,IF(VLOOKUP($A59,'GPIO Configuration'!$B$4:$L$97,11,FALSE)=\"1 - 使能\",1,0))","v":1},{"$f":"IF(ISNA(VLOOKUP($A59,'GPIO Configuration'!$B$4:$I$97,8,FALSE)),0,IF(VLOOKUP($A59,'GPIO Configuration'!$B$4:$I$97,8,FALSE)=\"上拉\",2,IF(VLOOKUP($A59,'GPIO Configuration'!$B$4:$I$97,8,FALSE)=\"下拉\",1,0)))","v":0},{"$f":"IF(ISNA(VLOOKUP($A59,'GPIO Configuration'!$B$4:$G$97,6,FALSE)),0,MATCH(VLOOKUP($A59,'GPIO Configuration'!$B$4:$G$97,6,FALSE),INDIRECT($A59&\"_Func\"),0)-1)","v":0},{"$f":"IF(ISNA(VLOOKUP($A59,'GPIO Configuration'!$B$4:$H$97,7,FALSE)),0,MATCH(VLOOKUP($A59,'GPIO Configuration'!$B$4:$H$97,7,FALSE),INDIRECT($A59&\"_OutDrv\"),0)-1)","v":3},{"$f":"IF(ISNA(VLOOKUP($A59,'GPIO Configuration'!$B$4:$M$97,12,FALSE)),0,IF(VLOOKUP($A59,'GPIO Configuration'!$B$4:$M$97,12,FALSE)=\"OUT - 输出\",1,0))","v":0},{"$f":"IF(ISNA(VLOOKUP($A59,'GPIO Configuration'!$B$4:$N$97,13,FALSE)),0,IF(VLOOKUP($A59,'GPIO Configuration'!$B$4:$N$97,13,FALSE)=\"1 - 高电平\",1,0))","v":0},{"$f":"IF(ISNA(VLOOKUP($A59,'GPIO Configuration'!$B$4:$S$97,18,FALSE)),0,IF(VLOOKUP($A59,'GPIO Configuration'!$B$4:$S$97,18,FALSE)=\"1 - 使能\",1,0))","v":0},{"$f":"IF(ISNA(VLOOKUP($A59,'GPIO Configuration'!$B$4:$R$97,17,FALSE)),0,MATCH(VLOOKUP($A59,'GPIO Configuration'!$B$4:$R$97,17,FALSE),INDIRECT($A59&\"_InLv\"),0)-1)","v":0},{"$f":"IF(ISNA(VLOOKUP($A59,'GPIO Configuration'!$B$4:$T$97,19,FALSE)),0,IF(VLOOKUP($A59,'GPIO Configuration'!$B$4:$T$97,19,FALSE)=\"1 - 使能\",1,0))","v":1},{"$f":"IF(ISNA(VLOOKUP($A59,'GPIO Configuration'!$B$4:$Q$97,16,FALSE)),0,IF(VLOOKUP($A59,'GPIO Configuration'!$B$4:$Q$97,16,FALSE)=\"上拉\",2,IF(VLOOKUP($A59,'GPIO Configuration'!$B$4:$Q$97,16,FALSE)=\"下拉\",1,0)))","v":0},{"$f":"IF(ISNA(VLOOKUP($A59,'GPIO Configuration'!$B$4:$O$97,14,FALSE)),0,MATCH(VLOOKUP($A59,'GPIO Configuration'!$B$4:$O$97,14,FALSE),INDIRECT($A59&\"_Func\"),0)-1)","v":0},{"$f":"IF(ISNA(VLOOKUP($A59,'GPIO Configuration'!$B$4:$P$97,15,FALSE)),0,MATCH(VLOOKUP($A59,'GPIO Configuration'!$B$4:$P$97,15,FALSE),INDIRECT($A59&\"_OutDrv\"),0)-1)","v":0}]
["P1_25",1,25,"0x0039","GPIO_PODR1_POD25","GPIO_PIDR1_PID25",{"$f":"IF(ISNA(VLOOKUP($A60,'GPIO Configuration'!$B$4:$C$97,2,FALSE)),0,1)","v":1},{"$f":"IF(ISNA(VLOOKUP($A60,'GPIO Configuration'!$B$4:$C$97,2,FALSE)),0,IF(VLOOKUP($A60,'GPIO Configuration'!$B$4:$C$97,2,FALSE)=\"是\",1,0))","v":1},{"$f":"IF(ISNA(VLOOKUP($A60,'GPIO Configuration'!$B$4:$D$97,3,FALSE)),\"\",TRIM(VLOOKUP($A60,'GPIO Configuration'!$B$4:$D$97,3,FALSE)))","v":"SD1_OUT"},{"$f":"IF(ISNA(VLOOKUP($A60,'GPIO Configuration'!$B$4:$E$97,4,FALSE)),0,IF(VLOOKUP($A60,'GPIO Configuration'!$B$4:$E$97,4,FALSE)=\"OUT - 输出\",1,0))","v":1},{"$f":"IF(ISNA(VLOOKUP($A60,'GPIO Configuration'!$B$4:$F$97,5,FALSE)),0,IF(VLOOKUP($A60,'GPIO Configuration'!$B$4:$F$97,5,FALSE)=\"1 - 高电平\",1,0))","v":0},{"$f":"IF(ISNA(VLOOKUP($A60,'GPIO Configuration'!$B$4:$K$97,10,FALSE)),0,IF(VLOOKUP($A60,'GPIO Configuration'!$B$4:$K$97,10,FALSE)=\"1 - 使能\",1,0))","v":0},{"$f":"IF(ISNA(VLOOKUP($A60,'GPIO Configuration'!$B$4:$J$97,9,FALSE)),0,MATCH(VLOOKUP($A60,'GPIO Configuration'!$B$4:$J$97,9,FALSE),INDIRECT($A60&\"_InLv\"),0)-1)","v":0},{"$f":"IF(ISNA(VLOOKUP($A60,'GPIO Configuration'!$B$4:$L$97,11,FALSE)),0,IF(VLOOKUP($A60,'GPIO Configuration'!$B$4:$L$97,11,FALSE)=\"1 - 使能\",1,0))","v":1},{"$f":"IF(ISNA(VLOOKUP($A60,'GPIO Configuration'!$B$4:$I$97,8,FALSE)),0,IF(VLOOKUP($A60,'GPIO Configuration'!$B$4:$I$97,8,FALSE)=\"上拉\",2,IF(VLOOKUP($A60,'GPIO Configuration'!$B$4:$I$97,8,FALSE)=\"下拉\",1,0)))","v":0},{"$f":"IF(ISNA(VLOOKUP($A60,'GPIO Configuration'!$B$4:$G$97,6,FALSE)),0,MATCH(VLOOKUP($A60,'GPIO Configuration'!$B$4:$G$97,6,FALSE),INDIRECT($A60&\"_Func\"),0)-1)","v":0},{"$f":"IF(ISNA(VLOOKUP($A60,'GPIO Configuration'!$B$4:$H$97,7,FALSE)),0,MATCH(VLOOKUP($A60,'GPIO Configuration'!$B$4:$H$97,7,FALSE),INDIRECT($A60&\"_OutDrv\"),0)-1)","v":3},{"$f":"IF(ISNA(VLOOKUP($A60,'GPIO Configuration'!$B$4:$M$97,12,FALSE)),0,IF(VLOOKUP($A60,'GPIO Configuration'!$B$4:$M$97,12,FALSE)=\"OUT - 输出\",1,0))","v":0},{"$f":"IF(ISNA(VLOOKUP($A60,'GPIO Configuration'!$B$4:$N$97,13,FALSE)),0,IF(VLOOKUP($A60,'GPIO Configuration'!$B$4:$N$97,13,FALSE)=\"1 - 高电平\",1,0))","v":0},{"$f":"IF(ISNA(VLOOKUP($A60,'GPIO Configuration'!$B$4:$S$97,18,FALSE)),0,IF(VLOOKUP($A60,'GPIO Configuration'!$B$4:$S$97,18,FALSE)=\"1 - 使能\",1,0))","v":0},{"$f":"IF(ISNA(VLOOKUP($A60,'GPIO Configuration'!$B$4:$R$97,17,FALSE)),0,MATCH(VLOOKUP($A60,'GPIO Configuration'!$B$4:$R$97,17,FALSE),INDIRECT($A60&\"_InLv\"),0)-1)","v":0},{"$f":"IF(ISNA(VLOOKUP($A60,'GPIO Configuration'!$B$4:$T$97,19,FALSE)),0,IF(VLOOKUP($A60,'GPIO Configuration'!$B$4:$T$97,19,FALSE)=\"1 - 使能\",1,0))","v":1},{"$f":"IF(ISNA(VLOOKUP($A60,'GPIO Configuration'!$B$4:$Q$97,16,FALSE)),0,IF(VLOOKUP($A60,'GPIO Configuration'!$B$4:$Q$97,16,FALSE)=\"上拉\",2,IF(VLOOKUP($A60,'GPIO Configuration'!$B$4:$Q$97,16,FALSE)=\"下拉\",1,0)))","v":0},{"$f":"IF(ISNA(VLOOKUP($A60,'GPIO Configuration'!$B$4:$O$97,14,FALSE)),0,MATCH(VLOOKUP($A60,'GPIO Configuration'!$B$4:$O$97,14,FALSE),INDIRECT($A60&\"_Func\"),0)-1)","v":0},{"$f":"IF(ISNA(VLOOKUP($A60,'GPIO Configuration'!$B$4:$P$97,15,FALSE)),0,MATCH(VLOOKUP($A60,'GPIO Configuration'!$B$4:$P$97,15,FALSE),INDIRECT($A60&\"_OutDrv\"),0)-1)","v":0}]
["P1_26",1,26,"0x003A","GPIO_PODR1_POD26","GPIO_PIDR1_PID26",{"$f":"IF(ISNA(VLOOKUP($A61,'GPIO Configuration'!$B$4:$C$97,2,FALSE)),0,1)","v":1},{"$f":"IF(ISNA(VLOOKUP($A61,'GPIO Configuration'!$B$4:$C$97,2,FALSE)),0,IF(VLOOKUP($A61,'GPIO Configuration'!$B$4:$C$97,2,FALSE)=\"是\",1,0))","v":1},{"$f":"IF(ISNA(VLOOKUP($A61,'GPIO Configuration'!$B$4:$D$97,3,FALSE)),\"\",TRIM(VLOOKUP($A61,'GPIO Configuration'!$B$4:$D$97,3,FALSE)))","v":"CSB0_OUT"},{"$f":"IF(ISNA(VLOOKUP($A61,'GPIO Configuration'!$B$4:$E$97,4,FALSE)),0,IF(VLOOKUP($A61,'GPIO Configuration'!$B$4:$E$97,4,FALSE)=\"OUT - 输出\",1,0))","v":1},{"$f":"IF(ISNA(VLOOKUP($A61,'GPIO Configuration'!$B$4:$F$97,5,FALSE)),0,IF(VLOOKUP($A61,'GPIO Configuration'!$B$4:$F$97,5,FALSE)=\"1 - 高电平\",1,0))","v":0},{"$f":"IF(ISNA(VLOOKUP($A61,'GPIO Configuration'!$B$4:$K$97,10,FALSE)),0,IF(VLOOKUP($A61,'GPIO Configuration'!$B$4:$K$97,10,FALSE)=\"1 - 使能\",1,0))","v":0},{"$f":"IF(ISNA(VLOOKUP($A61,'GPIO Configuration'!$B$4:$J$97,9,FALSE)),0,MATCH(VLOOKUP($A61,'GPIO Configuration'!$B$4:$J$97,9,FALSE),INDIRECT($A61&\"_InLv\"),0)-1)","v":0},{"$f":"IF(ISNA(VLOOKUP($A61,'GPIO Configuration'!$B$4:$L$97,11,FALSE)),0,IF(VLOOKUP($A61,'GPIO Configuration'!$B$4:$L$97,11,FALSE)=\"1 - 使能\",1,0))","v":0},{"$f":"IF(ISNA(VLOOKUP($A61,'GPIO Configuration'!$B$4:$I$97,8,FALSE)),0,IF(VLOOKUP($A61,'GPIO Configuration'!$B$4:$I$97,8,FALSE)=\"上拉\",2,IF(VLOOKUP($A61,'GPIO Configuration'!$B$4:$I$97,8,FALSE)=\"下拉\",1,0)))","v":0},{"$f":"IF(ISNA(VLOOKUP($A61,'GPIO Configuration'!$B$4:$G$97,6,FALSE)),0,MATCH(VLOOKUP($A61,'GPIO Configuration'!$B$4:$G$97,6,FALSE),INDIRECT($A61&\"_Func\"),0)-1)","v":0},{"$f":"IF(ISNA(VLOOKUP($A61,'GPIO Configuration'!$B$4:$H$97,7,FALSE)),0,MATCH(VLOOKUP($A61,'GPIO Configuration'!$B$4:$H$97,7,FALSE),INDIRECT($A61&\"_OutDrv\"),0)-1)","v":3},{"$f":"IF(ISNA(VLOOKUP($A61,'GPIO Configuration'!$B$4:$M$97,12,FALSE)),0,IF(VLOOKUP($A61,'GPIO Configuration'!$B$4:$M$97,12,FALSE)=\"OUT - 输出\",1,0))","v":0},{"$f":"IF(ISNA(VLOOKUP($A61,'GPIO Configuration'!$B$4:$N$97,13,FALSE)),0,IF(VLOOKUP($A61,'GPIO Configuration'!$B$4:$N$97,13,FALSE)=\"1 - 高电平\",1,0))","v":0},{"$f":"IF(ISNA(VLOOKUP($A61,'GPIO Configuration'!$B$4:$S$97,18,FALSE)),0,IF(VLOOKUP($A61,'GPIO Configuration'!$B$4:$S$97,18,FALSE)=\"1 - 使能\",1,0))","v":1},{"$f":"IF(ISNA(VLOOKUP($A61,'GPIO Configuration'!$B$4:$R$97,17,FALSE)),0,MATCH(VLOOKUP($A61,'GPIO Configuration'!$B$4:$R$97,17,FALSE),INDIRECT($A61&\"_InLv\"),0)-1)","v":0},{"$f":"IF(ISNA(VLOOKUP($A61,'GPIO Configuration'!$B$4:$T$97,19,FALSE)),0,IF(VLOOKUP($A61,'GPIO Configuration'!$B$4:$T$97,19,FALSE)=\"1 - 使能\",1,0))","v":0},{"$f":"IF(ISNA(VLOOKUP($A61,'GPIO Configuration'!$B$4:$Q$97,16,FALSE)),0,IF(VLOOKUP($A61,'GPIO Configuration'!$B$4:$Q$97,16,FALSE)=\"上拉\",2,IF(VLOOKUP($A61,'GPIO Configuration'!$B$4:$Q$97,16,FALSE)=\"下拉\",1,0)))","v":0},{"$f":"IF(ISNA(VLOOKUP($A61,'GPIO Configuration'!$B$4:$O$97,14,FALSE)),0,MATCH(VLOOKUP($A61,'GPIO Configuration'!$B$4:$O$97,14,FALSE),INDIRECT($A61&\"_Func\"),0)-1)","v":0},{"$f":"IF(ISNA(VLOOKUP($A61,'GPIO Configuration'!$B$4:$P$97,15,FALSE)),0,MATCH(VLOOKUP($A61,'GPIO Configuration'!$B$4:$P$97,15,FALSE),INDIRECT($A61&\"_OutDrv\"),0)-1)","v":0}]
["P1_27",1,27,"0x003B","GPIO_PODR1_POD27","GPIO_PIDR1_PID27",{"$f":"IF(ISNA(VLOOKUP($A62,'GPIO Configuration'!$B$4:$C$97,2,FALSE)),0,1)","v":1},{"$f":"IF(ISNA(VLOOKUP($A62,'GPIO Configuration'!$B$4:$C$97,2,FALSE)),0,IF(VLOOKUP($A62,'GPIO Configuration'!$B$4:$C$97,2,FALSE)=\"是\",1,0))","v":1},{"$f":"IF(ISNA(VLOOKUP($A62,'GPIO Configuration'!$B$4:$D$97,3,FALSE)),\"\",TRIM(VLOOKUP($A62,'GPIO Configuration'!$B$4:$D$97,3,FALSE)))","v":"SCL0_OUT"},{"$f":"IF(ISNA(VLOOKUP($A62,'GPIO Configuration'!$B$4:$E$97,4,FALSE)),0,IF(VLOOKUP($A62,'GPIO Configuration'!$B$4:$E$97,4,FALSE)=\"OUT - 输出\",1,0))","v":1},{"$f":"IF(ISNA(VLOOKUP($A62,'GPIO Configuration'!$B$4:$F$97,5,FALSE)),0,IF(VLOOKUP($A62,'GPIO Configuration'!$B$4:$F$97,5,FALSE)=\"1 - 高电平\",1,0))","v":0},{"$f":"IF(ISNA(VLOOKUP($A62,'GPIO Configuration'!$B$4:$K$97,10,FALSE)),0,IF(VLOOKUP($A62,'GPIO Configuration'!$B$4:$K$97,10,FALSE)=\"1 - 使能\",1,0))","v":0},{"$f":"IF(ISNA(VLOOKUP($A62,'GPIO Configuration'!$B$4:$J$97,9,FALSE)),0,MATCH(VLOOKUP($A62,'GPIO Configuration'!$B$4:$J$97,9,FALSE),INDIRECT($A62&\"_InLv\"),0)-1)","v":0},{"$f":"IF(ISNA(VLOOKUP($A62,'GPIO Configuration'!$B$4:$L$97,11,FALSE)),0,IF(VLOOKUP($A62,'GPIO Configuration'!$B$4:$L$97,11,FALSE)=\"1 - 使能\",1,0))","v":1},{"$f":"IF(ISNA(VLOOKUP($A62,'GPIO Configuration'!$B$4:$I$97,8,FALSE)),0,IF(VLOOKUP($A62,'GPIO Configuration'!$B$4:$I$97,8,FALSE)=\"上拉\",2,IF(VLOOKUP($A62,'GPIO Configuration'!$B$4:$I$97,8,FALSE)=\"下拉\",1,0)))","v":0},{"$f":"IF(ISNA(VLOOKUP($A62,'GPIO Configuration'!$B$4:$G$97,6,FALSE)),0,MATCH(VLOOKUP($A62,'GPIO Configuration'!$B$4:$G$97,6,FALSE),INDIRECT($A62&\"_Func\"),0)-1)","v":0},{"$f":"IF(ISNA(VLOOKUP($A62,'GPIO Configuration'!$B$4:$H$97,7,FALSE)),0,MATCH(VLOOKUP($A62,'GPIO Configuration'!$B$4:$H$97,7,FALSE),INDIRECT($A62&\"_OutDrv\"),0)-1)","v":3},{"$f":"IF(ISNA(VLOOKUP($A62,'GPIO Configuration'!$B$4:$M$97,12,FALSE)),0,IF(VLOOKUP($A62,'GPIO Configuration'!$B$4:$M$97,12,FALSE)=\"OUT - 输出\",1,0))","v":0},{"$f":"IF(ISNA(VLOOKUP($A62,'GPIO Configuration'!$B$4:$N$97,13,FALSE)),0,IF(VLOOKUP($A62,'GPIO Configuration'!$B$4:$N$97,13,FALSE)=\"1 - 高电平\",1,0))","v":0},{"$f":"IF(ISNA(VLOOKUP($A62,'GPIO Configuration'!$B$4:$S$97,18,FALSE)),0,IF(VLOOKUP($A62,'GPIO Configuration'!$B$4:$S$97,18,FALSE)=\"1 - 使能\",1,0))","v":0},{"$f":"IF(ISNA(VLOOKUP($A62,'GPIO Configuration'!$B$4:$R$97,17,FALSE)),0,MATCH(VLOOKUP($A62,'GPIO Configuration'!$B$4:$R$97,17,FALSE),INDIRECT($A62&\"_InLv\"),0)-1)","v":0},{"$f":"IF(ISNA(VLOOKUP($A62,'GPIO Configuration'!$B$4:$T$97,19,FALSE)),0,IF(VLOOKUP($A62,'GPIO Configuration'!$B$4:$T$97,19,FALSE)=\"1 - 使能\",1,0))","v":1},{"$f":"IF(ISNA(VLOOKUP($A62,'GPIO Configuration'!$B$4:$Q$97,16,FALSE)),0,IF(VLOOKUP($A62,'GPIO Configuration'!$B$4:$Q$97,16,FALSE)=\"上拉\",2,IF(VLOOKUP($A62,'GPIO Configuration'!$B$4:$Q$97,16,FALSE)=\"下拉\",1,0)))","v":0},{"$f":"IF(ISNA(VLOOKUP($A62,'GPIO Configuration'!$B$4:$O$97,14,FALSE)),0,MATCH(VLOOKUP($A62,'GPIO Configuration'!$B$4:$O$97,14,FALSE),INDIRECT($A62&\"_Func\"),0)-1)","v":0},{"$f":"IF(ISNA(VLOOKUP($A62,'GPIO Configuration'!$B$4:$P$97,15,FALSE)),0,MATCH(VLOOKUP($A62,'GPIO Configuration'!$B$4:$P$97,15,FALSE),INDIRECT($A62&\"_OutDrv\"),0)-1)","v":0}]
["P1_28",1,28,"0x003C","GPIO_PODR1_POD28","GPIO_PIDR1_PID28",{"$f":"IF(ISNA(VLOOKUP($A63,'GPIO Configuration'!$B$4:$C$97,2,FALSE)),0,1)","v":1},{"$f":"IF(ISNA(VLOOKUP($A63,'GPIO Configuration'!$B$4:$C$97,2,FALSE)),0,IF(VLOOKUP($A63,'GPIO Configuration'!$B$4:$C$97,2,FALSE)=\"是\",1,0))","v":1},{"$f":"IF(ISNA(VLOOKUP($A63,'GPIO Configuration'!$B$4:$D$97,3,FALSE)),\"\",TRIM(VLOOKUP($A63,'GPIO Configuration'!$B$4:$D$97,3,FALSE)))","v":"SD0_OUT"},{"$f":"IF(ISNA(VLOOKUP($A63,'GPIO Configuration'!$B$4:$E$97,4,FALSE)),0,IF(VLOOKUP($A63,'GPIO Configuration'!$B$4:$E$97,4,FALSE)=\"OUT - 输出\",1,0))","v":1},{"$f":"IF(ISNA(VLOOKUP($A63,'GPIO Configuration'!$B$4:$F$97,5,FALSE)),0,IF(VLOOKUP($A63,'GPIO Configuration'!$B$4:$F$97,5,FALSE)=\"1 - 高电平\",1,0))","v":0},{"$f":"IF(ISNA(VLOOKUP($A63,'GPIO Configuration'!$B$4:$K$97,10,FALSE)),0,IF(VLOOKUP($A63,'GPIO Configuration'!$B$4:$K$97,10,FALSE)=\"1 - 使能\",1,0))","v":0},{"$f":"IF(ISNA(VLOOKUP($A63,'GPIO Configuration'!$B$4:$J$97,9,FALSE)),0,MATCH(VLOOKUP($A63,'GPIO Configuration'!$B$4:$J$97,9,FALSE),INDIRECT($A63&\"_InLv\"),0)-1)","v":0},{"$f":"IF(ISNA(VLOOKUP($A63,'GPIO Configuration'!$B$4:$L$97,11,FALSE)),0,IF(VLOOKUP($A63,'GPIO Configuration'!$B$4:$L$97,11,FALSE)=\"1 - 使能\",1,0))","v":1},{"$f":"IF(ISNA(VLOOKUP($A63,'GPIO Configuration'!$B$4:$I$97,8,FALSE)),0,IF(VLOOKUP($A63,'GPIO Configuration'!$B$4:$I$97,8,FALSE)=\"上拉\",2,IF(VLOOKUP($A63,'GPIO Configuration'!$B$4:$I$97,8,FALSE)=\"下拉\",1,0)))","v":0},{"$f":"IF(ISNA(VLOOKUP($A63,'GPIO Configuration'!$B$4:$G$97,6,FALSE)),0,MATCH(VLOOKUP($A63,'GPIO Configuration'!$B$4:$G$97,6,FALSE),INDIRECT($A63&\"_Func\"),0)-1)","v":0},{"$f":"IF(ISNA(VLOOKUP($A63,'GPIO Configuration'!$B$4:$H$97,7,FALSE)),0,MATCH(VLOOKUP($A63,'GPIO Configuration'!$B$4:$H$97,7,FALSE),INDIRECT($A63&\"_OutDrv\"),0)-1)","v":3},{"$f":"IF(ISNA(VLOOKUP($A63,'GPIO Configuration'!$B$4:$M$97,12,FALSE)),0,IF(VLOOKUP($A63,'GPIO Configuration'!$B$4:$M$97,12,FALSE)=\"OUT - 输出\",1,0))","v":0},{"$f":"IF(ISNA(VLOOKUP($A63,'GPIO Configuration'!$B$4:$N$97,13,FALSE)),0,IF(VLOOKUP($A63,'GPIO Configuration'!$B$4:$N$97,13,FALSE)=\"1 - 高电平\",1,0))","v":0},{"$f":"IF(ISNA(VLOOKUP($A63,'GPIO Configuration'!$B$4:$S$97,18,FALSE)),0,IF(VLOOKUP($A63,'GPIO Configuration'!$B$4:$S$97,18,FALSE)=\"1 - 使能\",1,0))","v":0},{"$f":"IF(ISNA(VLOOKUP($A63,'GPIO Configuration'!$B$4:$R$97,17,FALSE)),0,MATCH(VLOOKUP($A63,'GPIO Configuration'!$B$4:$R$97,17,FALSE),INDIRECT($A63&\"_InLv\"),0)-1)","v":0},{"$f":"IF(ISNA(VLOOKUP($A63,'GPIO Configuration'!$B$4:$T$97,19,FALSE)),0,IF(VLOOKUP($A63,'GPIO Configuration'!$B$4:$T$97,19,FALSE)=\"1 - 使能\",1,0))","v":1},{"$f":"IF(ISNA(VLOOKUP($A63,'GPIO Configuration'!$B$4:$Q$97,16,FALSE)),0,IF(VLOOKUP($A63,'GPIO Configuration'!$B$4:$Q$97,16,FALSE)=\"上拉\",2,IF(VLOOKUP($A63,'GPIO Configuration'!$B$4:$Q$97,16,FALSE)=\"下拉\",1,0)))","v":0},{"$f":"IF(ISNA(VLOOKUP($A63,'GPIO Configuration'!$B$4:$O$97,14,FALSE)),0,MATCH(VLOOKUP($A63,'GPIO Configuration'!$B$4:$O$97,14,FALSE),INDIRECT($A63&\"_Func\"),0)-1)","v":0},{"$f":"IF(ISNA(VLOOKUP($A63,'GPIO Configuration'!$B$4:$P$97,15,FALSE)),0,MATCH(VLOOKUP($A63,'GPIO Configuration'!$B$4:$P$97,15,FALSE),INDIRECT($A63&\"_OutDrv\"),0)-1)","v":0}]
["P1_29",1,29,"0x003D","GPIO_PODR1_POD29","GPIO_PIDR1_PID29",{"$f":"IF(ISNA(VLOOKUP($A64,'GPIO Configuration'!$B$4:$C$97,2,FALSE)),0,1)","v":1},{"$f":"IF(ISNA(VLOOKUP($A64,'GPIO Configuration'!$B$4:$C$97,2,FALSE)),0,IF(VLOOKUP($A64,'GPIO Configuration'!$B$4:$C$97,2,FALSE)=\"是\",1,0))","v":1},{"$f":"IF(ISNA(VLOOKUP($A64,'GPIO Configuration'!$B$4:$D$97,3,FALSE)),\"\",TRIM(VLOOKUP($A64,'GPIO Configuration'!$B$4:$D$97,3,FALSE)))","v":"CSB_OUT"},{"$f":"IF(ISNA(VLOOKUP($A64,'GPIO Configuration'!$B$4:$E$97,4,FALSE)),0,IF(VLOOKUP($A64,'GPIO Configuration'!$B$4:$E$97,4,FALSE)=\"OUT - 输出\",1,0))","v":1},{"$f":"IF(ISNA(VLOOKUP($A64,'GPIO Configuration'!$B$4:$F$97,5,FALSE)),0,IF(VLOOKUP($A64,'GPIO Configuration'!$B$4:$F$97,5,FALSE)=\"1 - 高电平\",1,0))","v":0},{"$f":"IF(ISNA(VLOOKUP($A64,'GPIO Configuration'!$B$4:$K$97,10,FALSE)),0,IF(VLOOKUP($A64,'GPIO Configuration'!$B$4:$K$97,10,FALSE)=\"1 - 使能\",1,0))","v":0},{"$f":"IF(ISNA(VLOOKUP($A64,'GPIO Configuration'!$B$4:$J$97,9,FALSE)),0,MATCH(VLOOKUP($A64,'GPIO Configuration'!$B$4:$J$97,9,FALSE),INDIRECT($A64&\"_InLv\"),0)-1)","v":0},{"$f":"IF(ISNA(VLOOKUP($A64,'GPIO Configuration'!$B$4:$L$97,11,FALSE)),0,IF(VLOOKUP($A64,'GPIO Configuration'!$B$4:$L$97,11,FALSE)=\"1 - 使能\",1,0))","v":1},{"$f":"IF(ISNA(VLOOKUP($A64,'GPIO Configuration'!$B$4:$I$97,8,FALSE)),0,IF(VLOOKUP($A64,'GPIO Configuration'!$B$4:$I$97,8,FALSE)=\"上拉\",2,IF(VLOOKUP($A64,'GPIO Configuration'!$B$4:$I$97,8,FALSE)=\"下拉\",1,0)))","v":0},{"$f":"IF(ISNA(VLOOKUP($A64,'GPIO Configuration'!$B$4:$G$97,6,FALSE)),0,MATCH(VLOOKUP($A64,'GPIO Configuration'!$B$4:$G$97,6,FALSE),INDIRECT($A64&\"_Func\"),0)-1)","v":0},{"$f":"IF(ISNA(VLOOKUP($A64,'GPIO Configuration'!$B$4:$H$97,7,FALSE)),0,MATCH(VLOOKUP($A64,'GPIO Configuration'!$B$4:$H$97,7,FALSE),INDIRECT($A64&\"_OutDrv\"),0)-1)","v":3},{"$f":"IF(ISNA(VLOOKUP($A64,'GPIO Configuration'!$B$4:$M$97,12,FALSE)),0,IF(VLOOKUP($A64,'GPIO Configuration'!$B$4:$M$97,12,FALSE)=\"OUT - 输出\",1,0))","v":0},{"$f":"IF(ISNA(VLOOKUP($A64,'GPIO Configuration'!$B$4:$N$97,13,FALSE)),0,IF(VLOOKUP($A64,'GPIO Configuration'!$B$4:$N$97,13,FALSE)=\"1 - 高电平\",1,0))","v":0},{"$f":"IF(ISNA(VLOOKUP($A64,'GPIO Configuration'!$B$4:$S$97,18,FALSE)),0,IF(VLOOKUP($A64,'GPIO Configuration'!$B$4:$S$97,18,FALSE)=\"1 - 使能\",1,0))","v":0},{"$f":"IF(ISNA(VLOOKUP($A64,'GPIO Configuration'!$B$4:$R$97,17,FALSE)),0,MATCH(VLOOKUP($A64,'GPIO Configuration'!$B$4:$R$97,17,FALSE),INDIRECT($A64&\"_InLv\"),0)-1)","v":0},{"$f":"IF(ISNA(VLOOKUP($A64,'GPIO Configuration'!$B$4:$T$97,19,FALSE)),0,IF(VLOOKUP($A64,'GPIO Configuration'!$B$4:$T$97,19,FALSE)=\"1 - 使能\",1,0))","v":1},{"$f":"IF(ISNA(VLOOKUP($A64,'GPIO Configuration'!$B$4:$Q$97,16,FALSE)),0,IF(VLOOKUP($A64,'GPIO Configuration'!$B$4:$Q$97,16,FALSE)=\"上拉\",2,IF(VLOOKUP($A64,'GPIO Configuration'!$B$4:$Q$97,16,FALSE)=\"下拉\",1,0)))","v":0},{"$f":"IF(ISNA(VLOOKUP($A64,'GPIO Configuration'!$B$4:$O$97,14,FALSE)),0,MATCH(VLOOKUP($A64,'GPIO Configuration'!$B$4:$O$97,14,FALSE),INDIRECT($A64&\"_Func\"),0)-1)","v":0},{"$f":"IF(ISNA(VLOOKUP($A64,'GPIO Configuration'!$B$4:$P$97,15,FALSE)),0,MATCH(VLOOKUP($A64,'GPIO Configuration'!$B$4:$P$97,15,FALSE),INDIRECT($A64&\"_OutDrv\"),0)-1)","v":0}]
["P1_30",1,30,"0x003E","GPIO_PODR1_POD30","GPIO_PIDR1_PID30",{"$f":"IF(ISNA(VLOOKUP($A65,'GPIO Configuration'!$B$4:$C$97,2,FALSE)),0,1)","v":1},{"$f":"IF(ISNA(VLOOKUP($A65,'GPIO Configuration'!$B$4:$C$97,2,FALSE)),0,IF(VLOOKUP($A65,'GPIO Configuration'!$B$4:$C$97,2,FALSE)=\"是\",1,0))","v":1},{"$f":"IF(ISNA(VLOOKUP($A65,'GPIO Configuration'!$B$4:$D$97,3,FALSE)),\"\",TRIM(VLOOKUP($A65,'GPIO Configuration'!$B$4:$D$97,3,FALSE)))","v":"SCL_OUT"},{"$f":"IF(ISNA(VLOOKUP($A65,'GPIO Configuration'!$B$4:$E$97,4,FALSE)),0,IF(VLOOKUP($A65,'GPIO Configuration'!$B$4:$E$97,4,FALSE)=\"OUT - 输出\",1,0))","v":1},{"$f":"IF(ISNA(VLOOKUP($A65,'GPIO Configuration'!$B$4:$F$97,5,FALSE)),0,IF(VLOOKUP($A65,'GPIO Configuration'!$B$4:$F$97,5,FALSE)=\"1 - 高电平\",1,0))","v":0},{"$f":"IF(ISNA(VLOOKUP($A65,'GPIO Configuration'!$B$4:$K$97,10,FALSE)),0,IF(VLOOKUP($A65,'GPIO Configuration'!$B$4:$K$97,10,FALSE)=\"1 - 使能\",1,0))","v":0},{"$f":"IF(ISNA(VLOOKUP($A65,'GPIO Configuration'!$B$4:$J$97,9,FALSE)),0,MATCH(VLOOKUP($A65,'GPIO Configuration'!$B$4:$J$97,9,FALSE),INDIRECT($A65&\"_InLv\"),0)-1)","v":0},{"$f":"IF(ISNA(VLOOKUP($A65,'GPIO Configuration'!$B$4:$L$97,11,FALSE)),0,IF(VLOOKUP($A65,'GPIO Configuration'!$B$4:$L$97,11,FALSE)=\"1 - 使能\",1,0))","v":1},{"$f":"IF(ISNA(VLOOKUP($A65,'GPIO Configuration'!$B$4:$I$97,8,FALSE)),0,IF(VLOOKUP($A65,'GPIO Configuration'!$B$4:$I$97,8,FALSE)=\"上拉\",2,IF(VLOOKUP($A65,'GPIO Configuration'!$B$4:$I$97,8,FALSE)=\"下拉\",1,0)))","v":0},{"$f":"IF(ISNA(VLOOKUP($A65,'GPIO Configuration'!$B$4:$G$97,6,FALSE)),0,MATCH(VLOOKUP($A65,'GPIO Configuration'!$B$4:$G$97,6,FALSE),INDIRECT($A65&\"_Func\"),0)-1)","v":0},{"$f":"IF(ISNA(VLOOKUP($A65,'GPIO Configuration'!$B$4:$H$97,7,FALSE)),0,MATCH(VLOOKUP($A65,'GPIO Configuration'!$B$4:$H$97,7,FALSE),INDIRECT($A65&\"_OutDrv\"),0)-1)","v":3},{"$f":"IF(ISNA(VLOOKUP($A65,'GPIO Configuration'!$B$4:$M$97,12,FALSE)),0,IF(VLOOKUP($A65,'GPIO Configuration'!$B$4:$M$97,12,FALSE)=\"OUT - 输出\",1,0))","v":1},{"$f":"IF(ISNA(VLOOKUP($A65,'GPIO Configuration'!$B$4:$N$97,13,FALSE)),0,IF(VLOOKUP($A65,'GPIO Configuration'!$B$4:$N$97,13,FALSE)=\"1 - 高电平\",1,0))","v":0},{"$f":"IF(ISNA(VLOOKUP($A65,'GPIO Configuration'!$B$4:$S$97,18,FALSE)),0,IF(VLOOKUP($A65,'GPIO Configuration'!$B$4:$S$97,18,FALSE)=\"1 - 使能\",1,0))","v":0},{"$f":"IF(ISNA(VLOOKUP($A65,'GPIO Configuration'!$B$4:$R$97,17,FALSE)),0,MATCH(VLOOKUP($A65,'GPIO Configuration'!$B$4:$R$97,17,FALSE),INDIRECT($A65&\"_InLv\"),0)-1)","v":0},{"$f":"IF(ISNA(VLOOKUP($A65,'GPIO Configuration'!$B$4:$T$97,19,FALSE)),0,IF(VLOOKUP($A65,'GPIO Configuration'!$B$4:$T$97,19,FALSE)=\"1 - 使能\",1,0))","v":1},{"$f":"IF(ISNA(VLOOKUP($A65,'GPIO Configuration'!$B$4:$Q$97,16,FALSE)),0,IF(VLOOKUP($A65,'GPIO Configuration'!$B$4:$Q$97,16,FALSE)=\"上拉\",2,IF(VLOOKUP($A65,'GPIO Configuration'!$B$4:$Q$97,16,FALSE)=\"下拉\",1,0)))","v":0},{"$f":"IF(ISNA(VLOOKUP($A65,'GPIO Configuration'!$B$4:$O$97,14,FALSE)),0,MATCH(VLOOKUP($A65,'GPIO Configuration'!$B$4:$O$97,14,FALSE),INDIRECT($A65&\"_Func\"),0)-1)","v":0},{"$f":"IF(ISNA(VLOOKUP($A65,'GPIO Configuration'!$B$4:$P$97,15,FALSE)),0,MATCH(VLOOKUP($A65,'GPIO Configuration'!$B$4:$P$97,15,FALSE),INDIRECT($A65&\"_OutDrv\"),0)-1)","v":0}]
["P1_31",1,31,"0x003F","GPIO_PODR1_POD31","GPIO_PIDR1_PID31",{"$f":"IF(ISNA(VLOOKUP($A66,'GPIO Configuration'!$B$4:$C$97,2,FALSE)),0,1)","v":1},{"$f":"IF(ISNA(VLOOKUP($A66,'GPIO Configuration'!$B$4:$C$97,2,FALSE)),0,IF(VLOOKUP($A66,'GPIO Configuration'!$B$4:$C$97,2,FALSE)=\"是\",1,0))","v":1},{"$f":"IF(ISNA(VLOOKUP($A66,'GPIO Configuration'!$B$4:$D$97,3,FALSE)),\"\",TRIM(VLOOKUP($A66,'GPIO Configuration'!$B$4:$D$97,3,FALSE)))","v":"SD_OUT"},{"$f":"IF(ISNA(VLOOKUP($A66,'GPIO Configuration'!$B$4:$E$97,4,FALSE)),0,IF(VLOOKUP($A66,'GPIO Configuration'!$B$4:$E$97,4,FALSE)=\"OUT - 输出\",1,0))","v":1},{"$f":"IF(ISNA(VLOOKUP($A66,'GPIO Configuration'!$B$4:$F$97,5,FALSE)),0,IF(VLOOKUP($A66,'GPIO Configuration'!$B$4:$F$97,5,FALSE)=\"1 - 高电平\",1,0))","v":0},{"$f":"IF(ISNA(VLOOKUP($A66,'GPIO Configuration'!$B$4:$K$97,10,FALSE)),0,IF(VLOOKUP($A66,'GPIO Configuration'!$B$4:$K$97,10,FALSE)=\"1 - 使能\",1,0))","v":0},{"$f":"IF(ISNA(VLOOKUP($A66,'GPIO Configuration'!$B$4:$J$97,9,FALSE)),0,MATCH(VLOOKUP($A66,'GPIO Configuration'!$B$4:$J$97,9,FALSE),INDIRECT($A66&\"_InLv\"),0)-1)","v":0},{"$f":"IF(ISNA(VLOOKUP($A66,'GPIO Configuration'!$B$4:$L$97,11,FALSE)),0,IF(VLOOKUP($A66,'GPIO Configuration'!$B$4:$L$97,11,FALSE)=\"1 - 使能\",1,0))","v":1},{"$f":"IF(ISNA(VLOOKUP($A66,'GPIO Configuration'!$B$4:$I$97,8,FALSE)),0,IF(VLOOKUP($A66,'GPIO Configuration'!$B$4:$I$97,8,FALSE)=\"上拉\",2,IF(VLOOKUP($A66,'GPIO Configuration'!$B$4:$I$97,8,FALSE)=\"下拉\",1,0)))","v":0},{"$f":"IF(ISNA(VLOOKUP($A66,'GPIO Configuration'!$B$4:$G$97,6,FALSE)),0,MATCH(VLOOKUP($A66,'GPIO Configuration'!$B$4:$G$97,6,FALSE),INDIRECT($A66&\"_Func\"),0)-1)","v":0},{"$f":"IF(ISNA(VLOOKUP($A66,'GPIO Configuration'!$B$4:$H$97,7,FALSE)),0,MATCH(VLOOKUP($A66,'GPIO Configuration'!$B$4:$H$97,7,FALSE),INDIRECT($A66&\"_OutDrv\"),0)-1)","v":3},{"$f":"IF(ISNA(VLOOKUP($A66,'GPIO Configuration'!$B$4:$M$97,12,FALSE)),0,IF(VLOOKUP($A66,'GPIO Configuration'!$B$4:$M$97,12,FALSE)=\"OUT - 输出\",1,0))","v":1},{"$f":"IF(ISNA(VLOOKUP($A66,'GPIO Configuration'!$B$4:$N$97,13,FALSE)),0,IF(VLOOKUP($A66,'GPIO Configuration'!$B$4:$N$97,13,FALSE)=\"1 - 高电平\",1,0))","v":0},{"$f":"IF(ISNA(VLOOKUP($A66,'GPIO Configuration'!$B$4:$S$97,18,FALSE)),0,IF(VLOOKUP($A66,'GPIO Configuration'!$B$4:$S$97,18,FALSE)=\"1 - 使能\",1,0))","v":0},{"$f":"IF(ISNA(VLOOKUP($A66,'GPIO Configuration'!$B$4:$R$97,17,FALSE)),0,MATCH(VLOOKUP($A66,'GPIO Configuration'!$B$4:$R$97,17,FALSE),INDIRECT($A66&\"_InLv\"),0)-1)","v":0},{"$f":"IF(ISNA(VLOOKUP($A66,'GPIO Configuration'!$B$4:$T$97,19,FALSE)),0,IF(VLOOKUP($A66,'GPIO Configuration'!$B$4:$T$97,19,FALSE)=\"1 - 使能\",1,0))","v":1},{"$f":"IF(ISNA(VLOOKUP($A66,'GPIO Configuration'!$B$4:$Q$97,16,FALSE)),0,IF(VLOOKUP($A66,'GPIO Configuration'!$B$4:$Q$97,16,FALSE)=\"上拉\",2,IF(VLOOKUP($A66,'GPIO Configuration'!$B$4:$Q$97,16,FALSE)=\"下拉\",1,0)))","v":0},{"$f":"IF(ISNA(VLOOKUP($A66,'GPIO Configuration'!$B$4:$O$97,14,FALSE)),0,MATCH(VLOOKUP($A66,'GPIO Configuration'!$B$4:$O$97,14,FALSE),INDIRECT($A66&\"_Func\"),0)-1)","v":0},{"$f":"IF(ISNA(VLOOKUP($A66,'GPIO Configuration'!$B$4:$P$97,15,FALSE)),0,MATCH(VLOOKUP($A66,'GPIO Configuration'!$B$4:$P$97,15,FALSE),INDIRECT($A66&\"_OutDrv\"),0)-1)","v":0}]
["P2_00",2,0,"0x0040","GPIO_PODR2_POD0","GPIO_PIDR2_PID0",{"$f":"IF(ISNA(VLOOKUP($A67,'GPIO Configuration'!$B$4:$C$97,2,FALSE)),0,1)","v":1},{"$f":"IF(ISNA(VLOOKUP($A67,'GPIO Configuration'!$B$4:$C$97,2,FALSE)),0,IF(VLOOKUP($A67,'GPIO Configuration'!$B$4:$C$97,2,FALSE)=\"是\",1,0))","v":0},{"$f":"IF(ISNA(VLOOKUP($A67,'GPIO Configuration'!$B$4:$D$97,3,FALSE)),\"\",TRIM(VLOOKUP($A67,'GPIO Configuration'!$B$4:$D$97,3,FALSE)))","v":""},{"$f":"IF(ISNA(VLOOKUP($A67,'GPIO Configuration'!$B$4:$E$97,4,FALSE)),0,IF(VLOOKUP($A67,'GPIO Configuration'!$B$4:$E$97,4,FALSE)=\"OUT - 输出\",1,0))","v":0},{"$f":"IF(ISNA(VLOOKUP($A67,'GPIO Configuration'!$B$4:$F$97,5,FALSE)),0,IF(VLOOKUP($A67,'GPIO Configuration'!$B$4:$F$97,5,FALSE)=\"1 - 高电平\",1,0))","v":0},{"$f":"IF(ISNA(VLOOKUP($A67,'GPIO Configuration'!$B$4:$K$97,10,FALSE)),0,IF(VLOOKUP($A67,'GPIO Configuration'!$B$4:$K$97,10,FALSE)=\"1 - 使能\",1,0))","v":1},{"$f":"IF(ISNA(VLOOKUP($A67,'GPIO Configuration'!$B$4:$J$97,9,FALSE)),0,MATCH(VLOOKUP($A67,'GPIO Configuration'!$B$4:$J$97,9,FALSE),INDIRECT($A67&\"_InLv\"),0)-1)","v":0},{"$f":"IF(ISNA(VLOOKUP($A67,'GPIO Configuration'!$B$4:$L$97,11,FALSE)),0,IF(VLOOKUP($A67,'GPIO Configuration'!$B$4:$L$97,11,FALSE)=\"1 - 使能\",1,0))","v":1},{"$f":"IF(ISNA(VLOOKUP($A67,'GPIO Configuration'!$B$4:$I$97,8,FALSE)),0,IF(VLOOKUP($A67,'GPIO Configuration'!$B$4:$I$97,8,FALSE)=\"上拉\",2,IF(VLOOKUP($A67,'GPIO Configuration'!$B$4:$I$97,8,FALSE)=\"下拉\",1,0)))","v":0},{"$f":"IF(ISNA(VLOOKUP($A67,'GPIO Configuration'!$B$4:$G$97,6,FALSE)),0,MATCH(VLOOKUP($A67,'GPIO Configuration'!$B$4:$G$97,6,FALSE),INDIRECT($A67&\"_Func\"),0)-1)","v":0},{"$f":"IF(ISNA(VLOOKUP($A67,'GPIO Configuration'!$B$4:$H$97,7,FALSE)),0,MATCH(VLOOKUP($A67,'GPIO Configuration'!$B$4:$H$97,7,FALSE),INDIRECT($A67&\"_OutDrv\"),0)-1)","v":3},{"$f":"IF(ISNA(VLOOKUP($A67,'GPIO Configuration'!$B$4:$M$97,12,FALSE)),0,IF(VLOOKUP($A67,'GPIO Configuration'!$B$4:$M$97,12,FALSE)=\"OUT - 输出\",1,0))","v":0},{"$f":"IF(ISNA(VLOOKUP($A67,'GPIO Configuration'!$B$4:$N$97,13,FALSE)),0,IF(VLOOKUP($A67,'GPIO Configuration'!$B$4:$N$97,13,FALSE)=\"1 - 高电平\",1,0))","v":0},{"$f":"IF(ISNA(VLOOKUP($A67,'GPIO Configuration'!$B$4:$S$97,18,FALSE)),0,IF(VLOOKUP($A67,'GPIO Configuration'!$B$4:$S$97,18,FALSE)=\"1 - 使能\",1,0))","v":0},{"$f":"IF(ISNA(VLOOKUP($A67,'GPIO Configuration'!$B$4:$R$97,17,FALSE)),0,MATCH(VLOOKUP($A67,'GPIO Configuration'!$B$4:$R$97,17,FALSE),INDIRECT($A67&\"_InLv\"),0)-1)","v":0},{"$f":"IF(ISNA(VLOOKUP($A67,'GPIO Configuration'!$B$4:$T$97,19,FALSE)),0,IF(VLOOKUP($A67,'GPIO Configuration'!$B$4:$T$97,19,FALSE)=\"1 - 使能\",1,0))","v":1},{"$f":"IF(ISNA(VLOOKUP($A67,'GPIO Configuration'!$B$4:$Q$97,16,FALSE)),0,IF(VLOOKUP($A67,'GPIO Configuration'!$B$4:$Q$97,16,FALSE)=\"上拉\",2,IF(VLOOKUP($A67,'GPIO Configuration'!$B$4:$Q$97,16,FALSE)=\"下拉\",1,0)))","v":0},{"$f":"IF(ISNA(VLOOKUP($A67,'GPIO Configuration'!$B$4:$O$97,14,FALSE)),0,MATCH(VLOOKUP($A67,'GPIO Configuration'!$B$4:$O$97,14,FALSE),INDIRECT($A67&\"_Func\"),0)-1)","v":0},{"$f":"IF(ISNA(VLOOKUP($A67,'GPIO Configuration'!$B$4:$P$97,15,FALSE)),0,MATCH(VLOOKUP($A67,'GPIO Configuration'!$B$4:$P$97,15,FALSE),INDIRECT($A67&\"_OutDrv\"),0)-1)","v":0}]
["P2_01",2,1,"0x0041","GPIO_PODR2_POD1","GPIO_PIDR2_PID1",{"$f":"IF(ISNA(VLOOKUP($A68,'GPIO Configuration'!$B$4:$C$97,2,FALSE)),0,1)","v":1},{"$f":"IF(ISNA(VLOOKUP($A68,'GPIO Configuration'!$B$4:$C$97,2,FALSE)),0,IF(VLOOKUP($A68,'GPIO Configuration'!$B$4:$C$97,2,FALSE)=\"是\",1,0))","v":0},{"$f":"IF(ISNA(VLOOKUP($A68,'GPIO Configuration'!$B$4:$D$97,3,FALSE)),\"\",TRIM(VLOOKUP($A68,'GPIO Configuration'!$B$4:$D$97,3,FALSE)))","v":""},{"$f":"IF(ISNA(VLOOKUP($A68,'GPIO Configuration'!$B$4:$E$97,4,FALSE)),0,IF(VLOOKUP($A68,'GPIO Configuration'!$B$4:$E$97,4,FALSE)=\"OUT - 输出\",1,0))","v":1},{"$f":"IF(ISNA(VLOOKUP($A68,'GPIO Configuration'!$B$4:$F$97,5,FALSE)),0,IF(VLOOKUP($A68,'GPIO Configuration'!$B$4:$F$97,5,FALSE)=\"1 - 高电平\",1,0))","v":1},{"$f":"IF(ISNA(VLOOKUP($A68,'GPIO Configuration'!$B$4:$K$97,10,FALSE)),0,IF(VLOOKUP($A68,'GPIO Configuration'!$B$4:$K$97,10,FALSE)=\"1 - 使能\",1,0))","v":0},{"$f":"IF(ISNA(VLOOKUP($A68,'GPIO Configuration'!$B$4:$J$97,9,FALSE)),0,MATCH(VLOOKUP($A68,'GPIO Configuration'!$B$4:$J$97,9,FALSE),INDIRECT($A68&\"_InLv\"),0)-1)","v":0},{"$f":"IF(ISNA(VLOOKUP($A68,'GPIO Configuration'!$B$4:$L$97,11,FALSE)),0,IF(VLOOKUP($A68,'GPIO Configuration'!$B$4:$L$97,11,FALSE)=\"1 - 使能\",1,0))","v":1},{"$f":"IF(ISNA(VLOOKUP($A68,'GPIO Configuration'!$B$4:$I$97,8,FALSE)),0,IF(VLOOKUP($A68,'GPIO Configuration'!$B$4:$I$97,8,FALSE)=\"上拉\",2,IF(VLOOKUP($A68,'GPIO Configuration'!$B$4:$I$97,8,FALSE)=\"下拉\",1,0)))","v":0},{"$f":"IF(ISNA(VLOOKUP($A68,'GPIO Configuration'!$B$4:$G$97,6,FALSE)),0,MATCH(VLOOKUP($A68,'GPIO Configuration'!$B$4:$G$97,6,FALSE),INDIRECT($A68&\"_Func\"),0)-1)","v":0},{"$f":"IF(ISNA(VLOOKUP($A68,'GPIO Configuration'!$B$4:$H$97,7,FALSE)),0,MATCH(VLOOKUP($A68,'GPIO Configuration'!$B$4:$H$97,7,FALSE),INDIRECT($A68&\"_OutDrv\"),0)-1)","v":3},{"$f":"IF(ISNA(VLOOKUP($A68,'GPIO Configuration'!$B$4:$M$97,12,FALSE)),0,IF(VLOOKUP($A68,'GPIO Configuration'!$B$4:$M$97,12,FALSE)=\"OUT - 输出\",1,0))","v":1},{"$f":"IF(ISNA(VLOOKUP($A68,'GPIO Configuration'!$B$4:$N$97,13,FALSE)),0,IF(VLOOKUP($A68,'GPIO Configuration'!$B$4:$N$97,13,FALSE)=\"1 - 高电平\",1,0))","v":0},{"$f":"IF(ISNA(VLOOKUP($A68,'GPIO Configuration'!$B$4:$S$97,18,FALSE)),0,IF(VLOOKUP($A68,'GPIO Configuration'!$B$4:$S$97,18,FALSE)=\"1 - 使能\",1,0))","v":0},{"$f":"IF(ISNA(VLOOKUP($A68,'GPIO Configuration'!$B$4:$R$97,17,FALSE)),0,MATCH(VLOOKUP($A68,'GPIO Configuration'!$B$4:$R$97,17,FALSE),INDIRECT($A68&\"_InLv\"),0)-1)","v":0},{"$f":"IF(ISNA(VLOOKUP($A68,'GPIO Configuration'!$B$4:$T$97,19,FALSE)),0,IF(VLOOKUP($A68,'GPIO Configuration'!$B$4:$T$97,19,FALSE)=\"1 - 使能\",1,0))","v":1},{"$f":"IF(ISNA(VLOOKUP($A68,'GPIO Configuration'!$B$4:$Q$97,16,FALSE)),0,IF(VLOOKUP($A68,'GPIO Configuration'!$B$4:$Q$97,16,FALSE)=\"上拉\",2,IF(VLOOKUP($A68,'GPIO Configuration'!$B$4:$Q$97,16,FALSE)=\"下拉\",1,0)))","v":0},{"$f":"IF(ISNA(VLOOKUP($A68,'GPIO Configuration'!$B$4:$O$97,14,FALSE)),0,MATCH(VLOOKUP($A68,'GPIO Configuration'!$B$4:$O$97,14,FALSE),INDIRECT($A68&\"_Func\"),0)-1)","v":0},{"$f":"IF(ISNA(VLOOKUP($A68,'GPIO Configuration'!$B$4:$P$97,15,FALSE)),0,MATCH(VLOOKUP($A68,'GPIO Configuration'!$B$4:$P$97,15,FALSE),INDIRECT($A68&\"_OutDrv\"),0)-1)","v":0}]
["P2_02",2,2,"0x0042","GPIO_PODR2_POD2","GPIO_PIDR2_PID2",{"$f":"IF(ISNA(VLOOKUP($A69,'GPIO Configuration'!$B$4:$C$97,2,FALSE)),0,1)","v":1},{"$f":"IF(ISNA(VLOOKUP($A69,'GPIO Configuration'!$B$4:$C$97,2,FALSE)),0,IF(VLOOKUP($A69,'GPIO Configuration'!$B$4:$C$97,2,FALSE)=\"是\",1,0))","v":0},{"$f":"IF(ISNA(VLOOKUP($A69,'GPIO Configuration'!$B$4:$D$97,3,FALSE)),\"\",TRIM(VLOOKUP($A69,'GPIO Configuration'!$B$4:$D$97,3,FALSE)))","v":""},{"$f":"IF(ISNA(VLOOKUP($A69,'GPIO Configuration'!$B$4:$E$97,4,FALSE)),0,IF(VLOOKUP($A69,'GPIO Configuration'!$B$4:$E$97,4,FALSE)=\"OUT - 输出\",1,0))","v":0},{"$f":"IF(ISNA(VLOOKUP($A69,'GPIO Configuration'!$B$4:$F$97,5,FALSE)),0,IF(VLOOKUP($A69,'GPIO Configuration'!$B$4:$F$97,5,FALSE)=\"1 - 高电平\",1,0))","v":0},{"$f":"IF(ISNA(VLOOKUP($A69,'GPIO Configuration'!$B$4:$K$97,10,FALSE)),0,IF(VLOOKUP($A69,'GPIO Configuration'!$B$4:$K$97,10,FALSE)=\"1 - 使能\",1,0))","v":0},{"$f":"IF(ISNA(VLOOKUP($A69,'GPIO Configuration'!$B$4:$J$97,9,FALSE)),0,MATCH(VLOOKUP($A69,'GPIO Configuration'!$B$4:$J$97,9,FALSE),INDIRECT($A69&\"_InLv\"),0)-1)","v":0},{"$f":"IF(ISNA(VLOOKUP($A69,'GPIO Configuration'!$B$4:$L$97,11,FALSE)),0,IF(VLOOKUP($A69,'GPIO Configuration'!$B$4:$L$97,11,FALSE)=\"1 - 使能\",1,0))","v":1},{"$f":"IF(ISNA(VLOOKUP($A69,'GPIO Configuration'!$B$4:$I$97,8,FALSE)),0,IF(VLOOKUP($A69,'GPIO Configuration'!$B$4:$I$97,8,FALSE)=\"上拉\",2,IF(VLOOKUP($A69,'GPIO Configuration'!$B$4:$I$97,8,FALSE)=\"下拉\",1,0)))","v":0},{"$f":"IF(ISNA(VLOOKUP($A69,'GPIO Configuration'!$B$4:$G$97,6,FALSE)),0,MATCH(VLOOKUP($A69,'GPIO Configuration'!$B$4:$G$97,6,FALSE),INDIRECT($A69&\"_Func\"),0)-1)","v":0},{"$f":"IF(ISNA(VLOOKUP($A69,'GPIO Configuration'!$B$4:$H$97,7,FALSE)),0,MATCH(VLOOKUP($A69,'GPIO Configuration'!$B$4:$H$97,7,FALSE),INDIRECT($A69&\"_OutDrv\"),0)-1)","v":0},{"$f":"IF(ISNA(VLOOKUP($A69,'GPIO Configuration'!$B$4:$M$97,12,FALSE)),0,IF(VLOOKUP($A69,'GPIO Configuration'!$B$4:$M$97,12,FALSE)=\"OUT - 输出\",1,0))","v":0},{"$f":"IF(ISNA(VLOOKUP($A69,'GPIO Configuration'!$B$4:$N$97,13,FALSE)),0,IF(VLOOKUP($A69,'GPIO Configuration'!$B$4:$N$97,13,FALSE)=\"1 - 高电平\",1,0))","v":0},{"$f":"IF(ISNA(VLOOKUP($A69,'GPIO Configuration'!$B$4:$S$97,18,FALSE)),0,IF(VLOOKUP($A69,'GPIO Configuration'!$B$4:$S$97,18,FALSE)=\"1 - 使能\",1,0))","v":0},{"$f":"IF(ISNA(VLOOKUP($A69,'GPIO Configuration'!$B$4:$R$97,17,FALSE)),0,MATCH(VLOOKUP($A69,'GPIO Configuration'!$B$4:$R$97,17,FALSE),INDIRECT($A69&\"_InLv\"),0)-1)","v":0},{"$f":"IF(ISNA(VLOOKUP($A69,'GPIO Configuration'!$B$4:$T$97,19,FALSE)),0,IF(VLOOKUP($A69,'GPIO Configuration'!$B$4:$T$97,19,FALSE)=\"1 - 使能\",1,0))","v":1},{"$f":"IF(ISNA(VLOOKUP($A69,'GPIO Configuration'!$B$4:$Q$97,16,FALSE)),0,IF(VLOOKUP($A69,'GPIO Configuration'!$B$4:$Q$97,16,FALSE)=\"上拉\",2,IF(VLOOKUP($A69,'GPIO Configuration'!$B$4:$Q$97,16,FALSE)=\"下拉\",1,0)))","v":0},{"$f":"IF(ISNA(VLOOKUP($A69,'GPIO Configuration'!$B$4:$O$97,14,FALSE)),0,MATCH(VLOOKUP($A69,'GPIO Configuration'!$B$4:$O$97,14,FALSE),INDIRECT($A69&\"_Func\"),0)-1)","v":0},{"$f":"IF(ISNA(VLOOKUP($A69,'GPIO Configuration'!$B$4:$P$97,15,FALSE)),0,MATCH(VLOOKUP($A69,'GPIO Configuration'!$B$4:$P$97,15,FALSE),INDIRECT($A69&\"_OutDrv\"),0)-1)","v":0}]
["P2_03",2,3,"0x0043","GPIO_PODR2_POD3","GPIO_PIDR2_PID3",{"$f":"IF(ISNA(VLOOKUP($A70,'GPIO Configuration'!$B$4:$C$97,2,FALSE)),0,1)","v":1},{"$f":"IF(ISNA(VLOOKUP($A70,'GPIO Configuration'!$B$4:$C$97,2,FALSE)),0,IF(VLOOKUP($A70,'GPIO Configuration'!$B$4:$C$97,2,FALSE)=\"是\",1,0))","v":1},{"$f":"IF(ISNA(VLOOKUP($A70,'GPIO Configuration'!$B$4:$D$97,3,FALSE)),\"\",TRIM(VLOOKUP($A70,'GPIO Configuration'!$B$4:$D$97,3,FALSE)))","v":"Power_5V_EN"},{"$f":"IF(ISNA(VLOOKUP($A70,'GPIO Configuration'!$B$4:$E$97,4,FALSE)),0,IF(VLOOKUP($A70,'GPIO Configuration'!$B$4:$E$97,4,FALSE)=\"OUT - 输出\",1,0))","v":1},{"$f":"IF(ISNA(VLOOKUP($A70,'GPIO Configuration'!$B$4:$F$97,5,FALSE)),0,IF(VLOOKUP($A70,'GPIO Configuration'!$B$4:$F$97,5,FALSE)=\"1 - 高电平\",1,0))","v":1},{"$f":"IF(ISNA(VLOOKUP($A70,'GPIO Configuration'!$B$4:$K$97,10,FALSE)),0,IF(VLOOKUP($A70,'GPIO Configuration'!$B$4:$K$97,10,FALSE)=\"1 - 使能\",1,0))","v":0},{"$f":"IF(ISNA(VLOOKUP($A70,'GPIO Configuration'!$B$4:$J$97,9,FALSE)),0,MATCH(VLOOKUP($A70,'GPIO Configuration'!$B$4:$J$97,9,FALSE),INDIRECT($A70&\"_InLv\"),0)-1)","v":0},{"$f":"IF(ISNA(VLOOKUP($A70,'GPIO Configuration'!$B$4:$L$97,11,FALSE)),0,IF(VLOOKUP($A70,'GPIO Configuration'!$B$4:$L$97,11,FALSE)=\"1 - 使能\",1,0))","v":1},{"$f":"IF(ISNA(VLOOKUP($A70,'GPIO Configuration'!$B$4:$I$97,8,FALSE)),0,IF(VLOOKUP($A70,'GPIO Configuration'!$B$4:$I$97,8,FALSE)=\"上拉\",2,IF(VLOOKUP($A70,'GPIO Configuration'!$B$4:$I$97,8,FALSE)=\"下拉\",1,0)))","v":0},{"$f":"IF(ISNA(VLOOKUP($A70,'GPIO Configuration'!$B$4:$G$97,6,FALSE)),0,MATCH(VLOOKUP($A70,'GPIO Configuration'!$B$4:$G$97,6,FALSE),INDIRECT($A70&\"_Func\"),0)-1)","v":0},{"$f":"IF(ISNA(VLOOKUP($A70,'GPIO Configuration'!$B$4:$H$97,7,FALSE)),0,MATCH(VLOOKUP($A70,'GPIO Configuration'!$B$4:$H$97,7,FALSE),INDIRECT($A70&\"_OutDrv\"),0)-1)","v":3},{"$f":"IF(ISNA(VLOOKUP($A70,'GPIO Configuration'!$B$4:$M$97,12,FALSE)),0,IF(VLOOKUP($A70,'GPIO Configuration'!$B$4:$M$97,12,FALSE)=\"OUT - 输出\",1,0))","v":1},{"$f":"IF(ISNA(VLOOKUP($A70,'GPIO Configuration'!$B$4:$N$97,13,FALSE)),0,IF(VLOOKUP($A70,'GPIO Configuration'!$B$4:$N$97,13,FALSE)=\"1 - 高电平\",1,0))","v":0},{"$f":"IF(ISNA(VLOOKUP($A70,'GPIO Configuration'!$B$4:$S$97,18,FALSE)),0,IF(VLOOKUP($A70,'GPIO Configuration'!$B$4:$S$97,18,FALSE)=\"1 - 使能\",1,0))","v":0},{"$f":"IF(ISNA(VLOOKUP($A70,'GPIO Configuration'!$B$4:$R$97,17,FALSE)),0,MATCH(VLOOKUP($A70,'GPIO Configuration'!$B$4:$R$97,17,FALSE),INDIRECT($A70&\"_InLv\"),0)-1)","v":0},{"$f":"IF(ISNA(VLOOKUP($A70,'GPIO Configuration'!$B$4:$T$97,19,FALSE)),0,IF(VLOOKUP($A70,'GPIO Configuration'!$B$4:$T$97,19,FALSE)=\"1 - 使能\",1,0))","v":1},{"$f":"IF(ISNA(VLOOKUP($A70,'GPIO Configuration'!$B$4:$Q$97,16,FALSE)),0,IF(VLOOKUP($A70,'GPIO Configuration'!$B$4:$Q$97,16,FALSE)=\"上拉\",2,IF(VLOOKUP($A70,'GPIO Configuration'!$B$4:$Q$97,16,FALSE)=\"下拉\",1,0)))","v":0},{"$f":"IF(ISNA(VLOOKUP($A70,'GPIO Configuration'!$B$4:$O$97,14,FALSE)),0,MATCH(VLOOKUP($A70,'GPIO Configuration'!$B$4:$O$97,14,FALSE),INDIRECT($A70&\"_Func\"),0)-1)","v":0},{"$f":"IF(ISNA(VLOOKUP($A70,'GPIO Configuration'!$B$4:$P$97,15,FALSE)),0,MATCH(VLOOKUP($A70,'GPIO Configuration'!$B$4:$P$97,15,FALSE),INDIRECT($A70&\"_OutDrv\"),0)-1)","v":0}]
["P2_04",2,4,"0x0044","GPIO_PODR2_POD4","GPIO_PIDR2_PID4",{"$f":"IF(ISNA(VLOOKUP($A71,'GPIO Configuration'!$B$4:$C$97,2,FALSE)),0,1)","v":1},{"$f":"IF(ISNA(VLOOKUP($A71,'GPIO Configuration'!$B$4:$C$97,2,FALSE)),0,IF(VLOOKUP($A71,'GPIO Configuration'!$B$4:$C$97,2,FALSE)=\"是\",1,0))","v":0},{"$f":"IF(ISNA(VLOOKUP($A71,'GPIO Configuration'!$B$4:$D$97,3,FALSE)),\"\",TRIM(VLOOKUP($A71,'GPIO Configuration'!$B$4:$D$97,3,FALSE)))","v":""},{"$f":"IF(ISNA(VLOOKUP($A71,'GPIO Configuration'!$B$4:$E$97,4,FALSE)),0,IF(VLOOKUP($A71,'GPIO Configuration'!$B$4:$E$97,4,FALSE)=\"OUT - 输出\",1,0))","v":1},{"$f":"IF(ISNA(VLOOKUP($A71,'GPIO Configuration'!$B$4:$F$97,5,FALSE)),0,IF(VLOOKUP($A71,'GPIO Configuration'!$B$4:$F$97,5,FALSE)=\"1 - 高电平\",1,0))","v":0},{"$f":"IF(ISNA(VLOOKUP($A71,'GPIO Configuration'!$B$4:$K$97,10,FALSE)),0,IF(VLOOKUP($A71,'GPIO Configuration'!$B$4:$K$97,10,FALSE)=\"1 - 使能\",1,0))","v":0},{"$f":"IF(ISNA(VLOOKUP($A71,'GPIO Configuration'!$B$4:$J$97,9,FALSE)),0,MATCH(VLOOKUP($A71,'GPIO Configuration'!$B$4:$J$97,9,FALSE),INDIRECT($A71&\"_InLv\"),0)-1)","v":0},{"$f":"IF(ISNA(VLOOKUP($A71,'GPIO Configuration'!$B$4:$L$97,11,FALSE)),0,IF(VLOOKUP($A71,'GPIO Configuration'!$B$4:$L$97,11,FALSE)=\"1 - 使能\",1,0))","v":1},{"$f":"IF(ISNA(VLOOKUP($A71,'GPIO Configuration'!$B$4:$I$97,8,FALSE)),0,IF(VLOOKUP($A71,'GPIO Configuration'!$B$4:$I$97,8,FALSE)=\"上拉\",2,IF(VLOOKUP($A71,'GPIO Configuration'!$B$4:$I$97,8,FALSE)=\"下拉\",1,0)))","v":0},{"$f":"IF(ISNA(VLOOKUP($A71,'GPIO Configuration'!$B$4:$G$97,6,FALSE)),0,MATCH(VLOOKUP($A71,'GPIO Configuration'!$B$4:$G$97,6,FALSE),INDIRECT($A71&\"_Func\"),0)-1)","v":0},{"$f":"IF(ISNA(VLOOKUP($A71,'GPIO Configuration'!$B$4:$H$97,7,FALSE)),0,MATCH(VLOOKUP($A71,'GPIO Configuration'!$B$4:$H$97,7,FALSE),INDIRECT($A71&\"_OutDrv\"),0)-1)","v":3},{"$f":"IF(ISNA(VLOOKUP($A71,'GPIO Configuration'!$B$4:$M$97,12,FALSE)),0,IF(VLOOKUP($A71,'GPIO Configuration'!$B$4:$M$97,12,FALSE)=\"OUT - 输出\",1,0))","v":1},{"$f":"IF(ISNA(VLOOKUP($A71,'GPIO Configuration'!$B$4:$N$97,13,FALSE)),0,IF(VLOOKUP($A71,'GPIO Configuration'!$B$4:$N$97,13,FALSE)=\"1 - 高电平\",1,0))","v":0},{"$f":"IF(ISNA(VLOOKUP($A71,'GPIO Configuration'!$B$4:$S$97,18,FALSE)),0,IF(VLOOKUP($A71,'GPIO Configuration'!$B$4:$S$97,18,FALSE)=\"1 - 使能\",1,0))","v":0},{"$f":"IF(ISNA(VLOOKUP($A71,'GPIO Configuration'!$B$4:$R$97,17,FALSE)),0,MATCH(VLOOKUP($A71,'GPIO Configuration'!$B$4:$R$97,17,FALSE),INDIRECT($A71&\"_InLv\"),0)-1)","v":0},{"$f":"IF(ISNA(VLOOKUP($A71,'GPIO Configuration'!$B$4:$T$97,19,FALSE)),0,IF(VLOOKUP($A71,'GPIO Configuration'!$B$4:$T$97,19,FALSE)=\"1 - 使能\",1,0))","v":1},{"$f":"IF(ISNA(VLOOKUP($A71,'GPIO Configuration'!$B$4:$Q$97,16,FALSE)),0,IF(VLOOKUP($A71,'GPIO Configuration'!$B$4:$Q$97,16,FALSE)=\"上拉\",2,IF(VLOOKUP($A71,'GPIO Configuration'!$B$4:$Q$97,16,FALSE)=\"下拉\",1,0)))","v":0},{"$f":"IF(ISNA(VLOOKUP($A71,'GPIO Configuration'!$B$4:$O$97,14,FALSE)),0,MATCH(VLOOKUP($A71,'GPIO Configuration'!$B$4:$O$97,14,FALSE),INDIRECT($A71&\"_Func\"),0)-1)","v":0},{"$f":"IF(ISNA(VLOOKUP($A71,'GPIO Configuration'!$B$4:$P$97,15,FALSE)),0,MATCH(VLOOKUP($A71,'GPIO Configuration'!$B$4:$P$97,15,FALSE),INDIRECT($A71&\"_OutDrv\"),0)-1)","v":0}]
["P2_05",2,5,"0x0045","GPIO_PODR2_POD5","GPIO_PIDR2_PID5",{"$f":"IF(ISNA(VLOOKUP($A72,'GPIO Configuration'!$B$4:$C$97,2,FALSE)),0,1)","v":1},{"$f":"IF(ISNA(VLOOKUP($A72,'GPIO Configuration'!$B$4:$C$97,2,FALSE)),0,IF(VLOOKUP($A72,'GPIO Configuration'!$B$4:$C$97,2,FALSE)=\"是\",1,0))","v":0},{"$f":"IF(ISNA(VLOOKUP($A72,'GPIO Configuration'!$B$4:$D$97,3,FALSE)),\"\",TRIM(VLOOKUP($A72,'GPIO Configuration'!$B$4:$D$97,3,FALSE)))","v":""},{"$f":"IF(ISNA(VLOOKUP($A72,'GPIO Configuration'!$B$4:$E$97,4,FALSE)),0,IF(VLOOKUP($A72,'GPIO Configuration'!$B$4:$E$97,4,FALSE)=\"OUT - 输出\",1,0))","v":1},{"$f":"IF(ISNA(VLOOKUP($A72,'GPIO Configuration'!$B$4:$F$97,5,FALSE)),0,IF(VLOOKUP($A72,'GPIO Configuration'!$B$4:$F$97,5,FALSE)=\"1 - 高电平\",1,0))","v":0},{"$f":"IF(ISNA(VLOOKUP($A72,'GPIO Configuration'!$B$4:$K$97,10,FALSE)),0,IF(VLOOKUP($A72,'GPIO Configuration'!$B$4:$K$97,10,FALSE)=\"1 - 使能\",1,0))","v":0},{"$f":"IF(ISNA(VLOOKUP($A72,'GPIO Configuration'!$B$4:$J$97,9,FALSE)),0,MATCH(VLOOKUP($A72,'GPIO Configuration'!$B$4:$J$97,9,FALSE),INDIRECT($A72&\"_InLv\"),0)-1)","v":0},{"$f":"IF(ISNA(VLOOKUP($A72,'GPIO Configuration'!$B$4:$L$97,11,FALSE)),0,IF(VLOOKUP($A72,'GPIO Configuration'!$B$4:$L$97,11,FALSE)=\"1 - 使能\",1,0))","v":1},{"$f":"IF(ISNA(VLOOKUP($A72,'GPIO Configuration'!$B$4:$I$97,8,FALSE)),0,IF(VLOOKUP($A72,'GPIO Configuration'!$B$4:$I$97,8,FALSE)=\"上拉\",2,IF(VLOOKUP($A72,'GPIO Configuration'!$B$4:$I$97,8,FALSE)=\"下拉\",1,0)))","v":0},{"$f":"IF(ISNA(VLOOKUP($A72,'GPIO Configuration'!$B$4:$G$97,6,FALSE)),0,MATCH(VLOOKUP($A72,'GPIO Configuration'!$B$4:$G$97,6,FALSE),INDIRECT($A72&\"_Func\"),0)-1)","v":0},{"$f":"IF(ISNA(VLOOKUP($A72,'GPIO Configuration'!$B$4:$H$97,7,FALSE)),0,MATCH(VLOOKUP($A72,'GPIO Configuration'!$B$4:$H$97,7,FALSE),INDIRECT($A72&\"_OutDrv\"),0)-1)","v":3},{"$f":"IF(ISNA(VLOOKUP($A72,'GPIO Configuration'!$B$4:$M$97,12,FALSE)),0,IF(VLOOKUP($A72,'GPIO Configuration'!$B$4:$M$97,12,FALSE)=\"OUT - 输出\",1,0))","v":1},{"$f":"IF(ISNA(VLOOKUP($A72,'GPIO Configuration'!$B$4:$N$97,13,FALSE)),0,IF(VLOOKUP($A72,'GPIO Configuration'!$B$4:$N$97,13,FALSE)=\"1 - 高电平\",1,0))","v":0},{"$f":"IF(ISNA(VLOOKUP($A72,'GPIO Configuration'!$B$4:$S$97,18,FALSE)),0,IF(VLOOKUP($A72,'GPIO Configuration'!$B$4:$S$97,18,FALSE)=\"1 - 使能\",1,0))","v":0},{"$f":"IF(ISNA(VLOOKUP($A72,'GPIO Configuration'!$B$4:$R$97,17,FALSE)),0,MATCH(VLOOKUP($A72,'GPIO Configuration'!$B$4:$R$97,17,FALSE),INDIRECT($A72&\"_InLv\"),0)-1)","v":0},{"$f":"IF(ISNA(VLOOKUP($A72,'GPIO Configuration'!$B$4:$T$97,19,FALSE)),0,IF(VLOOKUP($A72,'GPIO Configuration'!$B$4:$T$97,19,FALSE)=\"1 - 使能\",1,0))","v":1},{"$f":"IF(ISNA(VLOOKUP($A72,'GPIO Configuration'!$B$4:$Q$97,16,FALSE)),0,IF(VLOOKUP($A72,'GPIO Configuration'!$B$4:$Q$97,16,FALSE)=\"上拉\",2,IF(VLOOKUP($A72,'GPIO Configuration'!$B$4:$Q$97,16,FALSE)=\"下拉\",1,0)))","v":0},{"$f":"IF(ISNA(VLOOKUP($A72,'GPIO Configuration'!$B$4:$O$97,14,FALSE)),0,MATCH(VLOOKUP($A72,'GPIO Configuration'!$B$4:$O$97,14,FALSE),INDIRECT($A72&\"_Func\"),0)-1)","v":0},{"$f":"IF(ISNA(VLOOKUP($A72,'GPIO Configuration'!$B$4:$P$97,15,FALSE)),0,MATCH(VLOOKUP($A72,'GPIO Configuration'!$B$4:$P$97,15,FALSE),INDIRECT($A72&\"_OutDrv\"),0)-1)","v":0}]
["P2_06",2,6,"0x0046","GPIO_PODR2_POD6","GPIO_PIDR2_PID6",{"$f":"IF(ISNA(VLOOKUP($A73,'GPIO Configuration'!$B$4:$C$97,2,FALSE)),0,1)","v":1},{"$f":"IF(ISNA(VLOOKUP($A73,'GPIO Configuration'!$B$4:$C$97,2,FALSE)),0,IF(VLOOKUP($A73,'GPIO Configuration'!$B$4:$C$97,2,FALSE)=\"是\",1,0))","v":0},{"$f":"IF(ISNA(VLOOKUP($A73,'GPIO Configuration'!$B$4:$D$97,3,FALSE)),\"\",TRIM(VLOOKUP($A73,'GPIO Configuration'!$B$4:$D$97,3,FALSE)))","v":""},{"$f":"IF(ISNA(VLOOKUP($A73,'GPIO Configuration'!$B$4:$E$97,4,FALSE)),0,IF(VLOOKUP($A73,'GPIO Configuration'!$B$4:$E$97,4,FALSE)=\"OUT - 输出\",1,0))","v":1},{"$f":"IF(ISNA(VLOOKUP($A73,'GPIO Configuration'!$B$4:$F$97,5,FALSE)),0,IF(VLOOKUP($A73,'GPIO Configuration'!$B$4:$F$97,5,FALSE)=\"1 - 高电平\",1,0))","v":0},{"$f":"IF(ISNA(VLOOKUP($A73,'GPIO Configuration'!$B$4:$K$97,10,FALSE)),0,IF(VLOOKUP($A73,'GPIO Configuration'!$B$4:$K$97,10,FALSE)=\"1 - 使能\",1,0))","v":0},{"$f":"IF(ISNA(VLOOKUP($A73,'GPIO Configuration'!$B$4:$J$97,9,FALSE)),0,MATCH(VLOOKUP($A73,'GPIO Configuration'!$B$4:$J$97,9,FALSE),INDIRECT($A73&\"_InLv\"),0)-1)","v":0},{"$f":"IF(ISNA(VLOOKUP($A73,'GPIO Configuration'!$B$4:$L$97,11,FALSE)),0,IF(VLOOKUP($A73,'GPIO Configuration'!$B$4:$L$97,11,FALSE)=\"1 - 使能\",1,0))","v":1},{"$f":"IF(ISNA(VLOOKUP($A73,'GPIO Configuration'!$B$4:$I$97,8,FALSE)),0,IF(VLOOKUP($A73,'GPIO Configuration'!$B$4:$I$97,8,FALSE)=\"上拉\",2,IF(VLOOKUP($A73,'GPIO Configuration'!$B$4:$I$97,8,FALSE)=\"下拉\",1,0)))","v":0},{"$f":"IF(ISNA(VLOOKUP($A73,'GPIO Configuration'!$B$4:$G$97,6,FALSE)),0,MATCH(VLOOKUP($A73,'GPIO Configuration'!$B$4:$G$97,6,FALSE),INDIRECT($A73&\"_Func\"),0)-1)","v":0},{"$f":"IF(ISNA(VLOOKUP($A73,'GPIO Configuration'!$B$4:$H$97,7,FALSE)),0,MATCH(VLOOKUP($A73,'GPIO Configuration'!$B$4:$H$97,7,FALSE),INDIRECT($A73&\"_OutDrv\"),0)-1)","v":3},{"$f":"IF(ISNA(VLOOKUP($A73,'GPIO Configuration'!$B$4:$M$97,12,FALSE)),0,IF(VLOOKUP($A73,'GPIO Configuration'!$B$4:$M$97,12,FALSE)=\"OUT - 输出\",1,0))","v":1},{"$f":"IF(ISNA(VLOOKUP($A73,'GPIO Configuration'!$B$4:$N$97,13,FALSE)),0,IF(VLOOKUP($A73,'GPIO Configuration'!$B$4:$N$97,13,FALSE)=\"1 - 高电平\",1,0))","v":0},{"$f":"IF(ISNA(VLOOKUP($A73,'GPIO Configuration'!$B$4:$S$97,18,FALSE)),0,IF(VLOOKUP($A73,'GPIO Configuration'!$B$4:$S$97,18,FALSE)=\"1 - 使能\",1,0))","v":0},{"$f":"IF(ISNA(VLOOKUP($A73,'GPIO Configuration'!$B$4:$R$97,17,FALSE)),0,MATCH(VLOOKUP($A73,'GPIO Configuration'!$B$4:$R$97,17,FALSE),INDIRECT($A73&\"_InLv\"),0)-1)","v":0},{"$f":"IF(ISNA(VLOOKUP($A73,'GPIO Configuration'!$B$4:$T$97,19,FALSE)),0,IF(VLOOKUP($A73,'GPIO Configuration'!$B$4:$T$97,19,FALSE)=\"1 - 使能\",1,0))","v":1},{"$f":"IF(ISNA(VLOOKUP($A73,'GPIO Configuration'!$B$4:$Q$97,16,FALSE)),0,IF(VLOOKUP($A73,'GPIO Configuration'!$B$4:$Q$97,16,FALSE)=\"上拉\",2,IF(VLOOKUP($A73,'GPIO Configuration'!$B$4:$Q$97,16,FALSE)=\"下拉\",1,0)))","v":0},{"$f":"IF(ISNA(VLOOKUP($A73,'GPIO Configuration'!$B$4:$O$97,14,FALSE)),0,MATCH(VLOOKUP($A73,'GPIO Configuration'!$B$4:$O$97,14,FALSE),INDIRECT($A73&\"_Func\"),0)-1)","v":0},{"$f":"IF(ISNA(VLOOKUP($A73,'GPIO Configuration'!$B$4:$P$97,15,FALSE)),0,MATCH(VLOOKUP($A73,'GPIO Configuration'!$B$4:$P$97,15,FALSE),INDIRECT($A73&\"_OutDrv\"),0)-1)","v":0}]
["P2_07",2,7,"0x0047","GPIO_PODR2_POD7","GPIO_PIDR2_PID7",{"$f":"IF(ISNA(VLOOKUP($A74,'GPIO Configuration'!$B$4:$C$97,2,FALSE)),0,1)","v":1},{"$f":"IF(ISNA(VLOOKUP($A74,'GPIO Configuration'!$B$4:$C$97,2,FALSE)),0,IF(VLOOKUP($A74,'GPIO Configuration'!$B$4:$C$97,2,FALSE)=\"是\",1,0))","v":0},{"$f":"IF(ISNA(VLOOKUP($A74,'GPIO Configuration'!$B$4:$D$97,3,FALSE)),\"\",TRIM(VLOOKUP($A74,'GPIO Configuration'!$B$4:$D$97,3,FALSE)))","v":""},{"$f":"IF(ISNA(VLOOKUP($A74,'GPIO Configuration'!$B$4:$E$97,4,FALSE)),0,IF(VLOOKUP($A74,'GPIO Configuration'!$B$4:$E$97,4,FALSE)=\"OUT - 输出\",1,0))","v":1},{"$f":"IF(ISNA(VLOOKUP($A74,'GPIO Configuration'!$B$4:$F$97,5,FALSE)),0,IF(VLOOKUP($A74,'GPIO Configuration'!$B$4:$F$97,5,FALSE)=\"1 - 高电平\",1,0))","v":0},{"$f":"IF(ISNA(VLOOKUP($A74,'GPIO Configuration'!$B$4:$K$97,10,FALSE)),0,IF(VLOOKUP($A74,'GPIO Configuration'!$B$4:$K$97,10,FALSE)=\"1 - 使能\",1,0))","v":0},{"$f":"IF(ISNA(VLOOKUP($A74,'GPIO Configuration'!$B$4:$J$97,9,FALSE)),0,MATCH(VLOOKUP($A74,'GPIO Configuration'!$B$4:$J$97,9,FALSE),INDIRECT($A74&\"_InLv\"),0)-1)","v":0},{"$f":"IF(ISNA(VLOOKUP($A74,'GPIO Configuration'!$B$4:$L$97,11,FALSE)),0,IF(VLOOKUP($A74,'GPIO Configuration'!$B$4:$L$97,11,FALSE)=\"1 - 使能\",1,0))","v":1},{"$f":"IF(ISNA(VLOOKUP($A74,'GPIO Configuration'!$B$4:$I$97,8,FALSE)),0,IF(VLOOKUP($A74,'GPIO Configuration'!$B$4:$I$97,8,FALSE)=\"上拉\",2,IF(VLOOKUP($A74,'GPIO Configuration'!$B$4:$I$97,8,FALSE)=\"下拉\",1,0)))","v":0},{"$f":"IF(ISNA(VLOOKUP($A74,'GPIO Configuration'!$B$4:$G$97,6,FALSE)),0,MATCH(VLOOKUP($A74,'GPIO Configuration'!$B$4:$G$97,6,FALSE),INDIRECT($A74&\"_Func\"),0)-1)","v":0},{"$f":"IF(ISNA(VLOOKUP($A74,'GPIO Configuration'!$B$4:$H$97,7,FALSE)),0,MATCH(VLOOKUP($A74,'GPIO Configuration'!$B$4:$H$97,7,FALSE),INDIRECT($A74&\"_OutDrv\"),0)-1)","v":3},{"$f":"IF(ISNA(VLOOKUP($A74,'GPIO Configuration'!$B$4:$M$97,12,FALSE)),0,IF(VLOOKUP($A74,'GPIO Configuration'!$B$4:$M$97,12,FALSE)=\"OUT - 输出\",1,0))","v":1},{"$f":"IF(ISNA(VLOOKUP($A74,'GPIO Configuration'!$B$4:$N$97,13,FALSE)),0,IF(VLOOKUP($A74,'GPIO Configuration'!$B$4:$N$97,13,FALSE)=\"1 - 高电平\",1,0))","v":0},{"$f":"IF(ISNA(VLOOKUP($A74,'GPIO Configuration'!$B$4:$S$97,18,FALSE)),0,IF(VLOOKUP($A74,'GPIO Configuration'!$B$4:$S$97,18,FALSE)=\"1 - 使能\",1,0))","v":0},{"$f":"IF(ISNA(VLOOKUP($A74,'GPIO Configuration'!$B$4:$R$97,17,FALSE)),0,MATCH(VLOOKUP($A74,'GPIO Configuration'!$B$4:$R$97,17,FALSE),INDIRECT($A74&\"_InLv\"),0)-1)","v":0},{"$f":"IF(ISNA(VLOOKUP($A74,'GPIO Configuration'!$B$4:$T$97,19,FALSE)),0,IF(VLOOKUP($A74,'GPIO Configuration'!$B$4:$T$97,19,FALSE)=\"1 - 使能\",1,0))","v":1},{"$f":"IF(ISNA(VLOOKUP($A74,'GPIO Configuration'!$B$4:$Q$97,16,FALSE)),0,IF(VLOOKUP($A74,'GPIO Configuration'!$B$4:$Q$97,16,FALSE)=\"上拉\",2,IF(VLOOKUP($A74,'GPIO Configuration'!$B$4:$Q$97,16,FALSE)=\"下拉\",1,0)))","v":0},{"$f":"IF(ISNA(VLOOKUP($A74,'GPIO Configuration'!$B$4:$O$97,14,FALSE)),0,MATCH(VLOOKUP($A74,'GPIO Configuration'!$B$4:$O$97,14,FALSE),INDIRECT($A74&\"_Func\"),0)-1)","v":0},{"$f":"IF(ISNA(VLOOKUP($A74,'GPIO Configuration'!$B$4:$P$97,15,FALSE)),0,MATCH(VLOOKUP($A74,'GPIO Configuration'!$B$4:$P$97,15,FALSE),INDIRECT($A74&\"_OutDrv\"),0)-1)","v":0}]
["P2_08",2,8,"0x0048","GPIO_PODR2_POD8","GPIO_PIDR2_PID8",{"$f":"IF(ISNA(VLOOKUP($A75,'GPIO Configuration'!$B$4:$C$97,2,FALSE)),0,1)","v":1},{"$f":"IF(ISNA(VLOOKUP($A75,'GPIO Configuration'!$B$4:$C$97,2,FALSE)),0,IF(VLOOKUP($A75,'GPIO Configuration'!$B$4:$C$97,2,FALSE)=\"是\",1,0))","v":1},{"$f":"IF(ISNA(VLOOKUP($A75,'GPIO Configuration'!$B$4:$D$97,3,FALSE)),\"\",TRIM(VLOOKUP($A75,'GPIO Configuration'!$B$4:$D$97,3,FALSE)))","v":""},{"$f":"IF(ISNA(VLOOKUP($A75,'GPIO Configuration'!$B$4:$E$97,4,FALSE)),0,IF(VLOOKUP($A75,'GPIO Configuration'!$B$4:$E$97,4,FALSE)=\"OUT - 输出\",1,0))","v":1},{"$f":"IF(ISNA(VLOOKUP($A75,'GPIO Configuration'!$B$4:$F$97,5,FALSE)),0,IF(VLOOKUP($A75,'GPIO Configuration'!$B$4:$F$97,5,FALSE)=\"1 - 高电平\",1,0))","v":0},{"$f":"IF(ISNA(VLOOKUP($A75,'GPIO Configuration'!$B$4:$K$97,10,FALSE)),0,IF(VLOOKUP($A75,'GPIO Configuration'!$B$4:$K$97,10,FALSE)=\"1 - 使能\",1,0))","v":0},{"$f":"IF(ISNA(VLOOKUP($A75,'GPIO Configuration'!$B$4:$J$97,9,FALSE)),0,MATCH(VLOOKUP($A75,'GPIO Configuration'!$B$4:$J$97,9,FALSE),INDIRECT($A75&\"_InLv\"),0)-1)","v":0},{"$f":"IF(ISNA(VLOOKUP($A75,'GPIO Configuration'!$B$4:$L$97,11,FALSE)),0,IF(VLOOKUP($A75,'GPIO Configuration'!$B$4:$L$97,11,FALSE)=\"1 - 使能\",1,0))","v":1},{"$f":"IF(ISNA(VLOOKUP($A75,'GPIO Configuration'!$B$4:$I$97,8,FALSE)),0,IF(VLOOKUP($A75,'GPIO Configuration'!$B$4:$I$97,8,FALSE)=\"上拉\",2,IF(VLOOKUP($A75,'GPIO Configuration'!$B$4:$I$97,8,FALSE)=\"下拉\",1,0)))","v":0},{"$f":"IF(ISNA(VLOOKUP($A75,'GPIO Configuration'!$B$4:$G$97,6,FALSE)),0,MATCH(VLOOKUP($A75,'GPIO Configuration'!$B$4:$G$97,6,FALSE),INDIRECT($A75&\"_Func\"),0)-1)","v":0},{"$f":"IF(ISNA(VLOOKUP($A75,'GPIO Configuration'!$B$4:$H$97,7,FALSE)),0,MATCH(VLOOKUP($A75,'GPIO Configuration'!$B$4:$H$97,7,FALSE),INDIRECT($A75&\"_OutDrv\"),0)-1)","v":3},{"$f":"IF(ISNA(VLOOKUP($A75,'GPIO Configuration'!$B$4:$M$97,12,FALSE)),0,IF(VLOOKUP($A75,'GPIO Configuration'!$B$4:$M$97,12,FALSE)=\"OUT - 输出\",1,0))","v":1},{"$f":"IF(ISNA(VLOOKUP($A75,'GPIO Configuration'!$B$4:$N$97,13,FALSE)),0,IF(VLOOKUP($A75,'GPIO Configuration'!$B$4:$N$97,13,FALSE)=\"1 - 高电平\",1,0))","v":0},{"$f":"IF(ISNA(VLOOKUP($A75,'GPIO Configuration'!$B$4:$S$97,18,FALSE)),0,IF(VLOOKUP($A75,'GPIO Configuration'!$B$4:$S$97,18,FALSE)=\"1 - 使能\",1,0))","v":0},{"$f":"IF(ISNA(VLOOKUP($A75,'GPIO Configuration'!$B$4:$R$97,17,FALSE)),0,MATCH(VLOOKUP($A75,'GPIO Configuration'!$B$4:$R$97,17,FALSE),INDIRECT($A75&\"_InLv\"),0)-1)","v":0},{"$f":"IF(ISNA(VLOOKUP($A75,'GPIO Configuration'!$B$4:$T$97,19,FALSE)),0,IF(VLOOKUP($A75,'GPIO Configuration'!$B$4:$T$97,19,FALSE)=\"1 - 使能\",1,0))","v":1},{"$f":"IF(ISNA(VLOOKUP($A75,'GPIO Configuration'!$B$4:$Q$97,16,FALSE)),0,IF(VLOOKUP($A75,'GPIO Configuration'!$B$4:$Q$97,16,FALSE)=\"上拉\",2,IF(VLOOKUP($A75,'GPIO Configuration'!$B$4:$Q$97,16,FALSE)=\"下拉\",1,0)))","v":0},{"$f":"IF(ISNA(VLOOKUP($A75,'GPIO Configuration'!$B$4:$O$97,14,FALSE)),0,MATCH(VLOOKUP($A75,'GPIO Configuration'!$B$4:$O$97,14,FALSE),INDIRECT($A75&\"_Func\"),0)-1)","v":0},{"$f":"IF(ISNA(VLOOKUP($A75,'GPIO Configuration'!$B$4:$P$97,15,FALSE)),0,MATCH(VLOOKUP($A75,'GPIO Configuration'!$B$4:$P$97,15,FALSE),INDIRECT($A75&\"_OutDrv\"),0)-1)","v":0}]
["P2_09",2,9,"0x0049","GPIO_PODR2_POD9","GPIO_PIDR2_PID9",{"$f":"IF(ISNA(VLOOKUP($A76,'GPIO Configuration'!$B$4:$C$97,2,FALSE)),0,1)","v":1},{"$f":"IF(ISNA(VLOOKUP($A76,'GPIO Configuration'!$B$4:$C$97,2,FALSE)),0,IF(VLOOKUP($A76,'GPIO Configuration'!$B$4:$C$97,2,FALSE)=\"是\",1,0))","v":0},{"$f":"IF(ISNA(VLOOKUP($A76,'GPIO Configuration'!$B$4:$D$97,3,FALSE)),\"\",TRIM(VLOOKUP($A76,'GPIO Configuration'!$B$4:$D$97,3,FALSE)))","v":""},{"$f":"IF(ISNA(VLOOKUP($A76,'GPIO Configuration'!$B$4:$E$97,4,FALSE)),0,IF(VLOOKUP($A76,'GPIO Configuration'!$B$4:$E$97,4,FALSE)=\"OUT - 输出\",1,0))","v":1},{"$f":"IF(ISNA(VLOOKUP($A76,'GPIO Configuration'!$B$4:$F$97,5,FALSE)),0,IF(VLOOKUP($A76,'GPIO Configuration'!$B$4:$F$97,5,FALSE)=\"1 - 高电平\",1,0))","v":0},{"$f":"IF(ISNA(VLOOKUP($A76,'GPIO Configuration'!$B$4:$K$97,10,FALSE)),0,IF(VLOOKUP($A76,'GPIO Configuration'!$B$4:$K$97,10,FALSE)=\"1 - 使能\",1,0))","v":0},{"$f":"IF(ISNA(VLOOKUP($A76,'GPIO Configuration'!$B$4:$J$97,9,FALSE)),0,MATCH(VLOOKUP($A76,'GPIO Configuration'!$B$4:$J$97,9,FALSE),INDIRECT($A76&\"_InLv\"),0)-1)","v":0},{"$f":"IF(ISNA(VLOOKUP($A76,'GPIO Configuration'!$B$4:$L$97,11,FALSE)),0,IF(VLOOKUP($A76,'GPIO Configuration'!$B$4:$L$97,11,FALSE)=\"1 - 使能\",1,0))","v":0},{"$f":"IF(ISNA(VLOOKUP($A76,'GPIO Configuration'!$B$4:$I$97,8,FALSE)),0,IF(VLOOKUP($A76,'GPIO Configuration'!$B$4:$I$97,8,FALSE)=\"上拉\",2,IF(VLOOKUP($A76,'GPIO Configuration'!$B$4:$I$97,8,FALSE)=\"下拉\",1,0)))","v":0},{"$f":"IF(ISNA(VLOOKUP($A76,'GPIO Configuration'!$B$4:$G$97,6,FALSE)),0,MATCH(VLOOKUP($A76,'GPIO Configuration'!$B$4:$G$97,6,FALSE),INDIRECT($A76&\"_Func\"),0)-1)","v":0},{"$f":"IF(ISNA(VLOOKUP($A76,'GPIO Configuration'!$B$4:$H$97,7,FALSE)),0,MATCH(VLOOKUP($A76,'GPIO Configuration'!$B$4:$H$97,7,FALSE),INDIRECT($A76&\"_OutDrv\"),0)-1)","v":3},{"$f":"IF(ISNA(VLOOKUP($A76,'GPIO Configuration'!$B$4:$M$97,12,FALSE)),0,IF(VLOOKUP($A76,'GPIO Configuration'!$B$4:$M$97,12,FALSE)=\"OUT - 输出\",1,0))","v":1},{"$f":"IF(ISNA(VLOOKUP($A76,'GPIO Configuration'!$B$4:$N$97,13,FALSE)),0,IF(VLOOKUP($A76,'GPIO Configuration'!$B$4:$N$97,13,FALSE)=\"1 - 高电平\",1,0))","v":0},{"$f":"IF(ISNA(VLOOKUP($A76,'GPIO Configuration'!$B$4:$S$97,18,FALSE)),0,IF(VLOOKUP($A76,'GPIO Configuration'!$B$4:$S$97,18,FALSE)=\"1 - 使能\",1,0))","v":0},{"$f":"IF(ISNA(VLOOKUP($A76,'GPIO Configuration'!$B$4:$R$97,17,FALSE)),0,MATCH(VLOOKUP($A76,'GPIO Configuration'!$B$4:$R$97,17,FALSE),INDIRECT($A76&\"_InLv\"),0)-1)","v":0},{"$f":"IF(ISNA(VLOOKUP($A76,'GPIO Configuration'!$B$4:$T$97,19,FALSE)),0,IF(VLOOKUP($A76,'GPIO Configuration'!$B$4:$T$97,19,FALSE)=\"1 - 使能\",1,0))","v":1},{"$f":"IF(ISNA(VLOOKUP($A76,'GPIO Configuration'!$B$4:$Q$97,16,FALSE)),0,IF(VLOOKUP($A76,'GPIO Configuration'!$B$4:$Q$97,16,FALSE)=\"上拉\",2,IF(VLOOKUP($A76,'GPIO Configuration'!$B$4:$Q$97,16,FALSE)=\"下拉\",1,0)))","v":0},{"$f":"IF(ISNA(VLOOKUP($A76,'GPIO Configuration'!$B$4:$O$97,14,FALSE)),0,MATCH(VLOOKUP($A76,'GPIO Configuration'!$B$4:$O$97,14,FALSE),INDIRECT($A76&\"_Func\"),0)-1)","v":0},{"$f":"IF(ISNA(VLOOKUP($A76,'GPIO Configuration'!$B$4:$P$97,15,FALSE)),0,MATCH(VLOOKUP($A76,'GPIO Configuration'!$B$4:$P$97,15,FALSE),INDIRECT($A76&\"_OutDrv\"),0)-1)","v":0}]
["P2_10",2,10,"0x004A","GPIO_PODR2_POD10","GPIO_PIDR2_PID10",{"$f":"IF(ISNA(VLOOKUP($A77,'GPIO Configuration'!$B$4:$C$97,2,FALSE)),0,1)","v":1},{"$f":"IF(ISNA(VLOOKUP($A77,'GPIO Configuration'!$B$4:$C$97,2,FALSE)),0,IF(VLOOKUP($A77,'GPIO Configuration'!$B$4:$C$97,2,FALSE)=\"是\",1,0))","v":0},{"$f":"IF(ISNA(VLOOKUP($A77,'GPIO Configuration'!$B$4:$D$97,3,FALSE)),\"\",TRIM(VLOOKUP($A77,'GPIO Configuration'!$B$4:$D$97,3,FALSE)))","v":""},{"$f":"IF(ISNA(VLOOKUP($A77,'GPIO Configuration'!$B$4:$E$97,4,FALSE)),0,IF(VLOOKUP($A77,'GPIO Configuration'!$B$4:$E$97,4,FALSE)=\"OUT - 输出\",1,0))","v":1},{"$f":"IF(ISNA(VLOOKUP($A77,'GPIO Configuration'!$B$4:$F$97,5,FALSE)),0,IF(VLOOKUP($A77,'GPIO Configuration'!$B$4:$F$97,5,FALSE)=\"1 - 高电平\",1,0))","v":0},{"$f":"IF(ISNA(VLOOKUP($A77,'GPIO Configuration'!$B$4:$K$97,10,FALSE)),0,IF(VLOOKUP($A77,'GPIO Configuration'!$B$4:$K$97,10,FALSE)=\"1 - 使能\",1,0))","v":0},{"$f":"IF(ISNA(VLOOKUP($A77,'GPIO Configuration'!$B$4:$J$97,9,FALSE)),0,MATCH(VLOOKUP($A77,'GPIO Configuration'!$B$4:$J$97,9,FALSE),INDIRECT($A77&\"_InLv\"),0)-1)","v":0},{"$f":"IF(ISNA(VLOOKUP($A77,'GPIO Configuration'!$B$4:$L$97,11,FALSE)),0,IF(VLOOKUP($A77,'GPIO Configuration'!$B$4:$L$97,11,FALSE)=\"1 - 使能\",1,0))","v":0},{"$f":"IF(ISNA(VLOOKUP($A77,'GPIO Configuration'!$B$4:$I$97,8,FALSE)),0,IF(VLOOKUP($A77,'GPIO Configuration'!$B$4:$I$97,8,FALSE)=\"上拉\",2,IF(VLOOKUP($A77,'GPIO Configuration'!$B$4:$I$97,8,FALSE)=\"下拉\",1,0)))","v":0},{"$f":"IF(ISNA(VLOOKUP($A77,'GPIO Configuration'!$B$4:$G$97,6,FALSE)),0,MATCH(VLOOKUP($A77,'GPIO Configuration'!$B$4:$G$97,6,FALSE),INDIRECT($A77&\"_Func\"),0)-1)","v":0},{"$f":"IF(ISNA(VLOOKUP($A77,'GPIO Configuration'!$B$4:$H$97,7,FALSE)),0,MATCH(VLOOKUP($A77,'GPIO Configuration'!$B$4:$H$97,7,FALSE),INDIRECT($A77&\"_OutDrv\"),0)-1)","v":3},{"$f":"IF(ISNA(VLOOKUP($A77,'GPIO Configuration'!$B$4:$M$97,12,FALSE)),0,IF(VLOOKUP($A77,'GPIO Configuration'!$B$4:$M$97,12,FALSE)=\"OUT - 输出\",1,0))","v":1},{"$f":"IF(ISNA(VLOOKUP($A77,'GPIO Configuration'!$B$4:$N$97,13,FALSE)),0,IF(VLOOKUP($A77,'GPIO Configuration'!$B$4:$N$97,13,FALSE)=\"1 - 高电平\",1,0))","v":0},{"$f":"IF(ISNA(VLOOKUP($A77,'GPIO Configuration'!$B$4:$S$97,18,FALSE)),0,IF(VLOOKUP($A77,'GPIO Configuration'!$B$4:$S$97,18,FALSE)=\"1 - 使能\",1,0))","v":0},{"$f":"IF(ISNA(VLOOKUP($A77,'GPIO Configuration'!$B$4:$R$97,17,FALSE)),0,MATCH(VLOOKUP($A77,'GPIO Configuration'!$B$4:$R$97,17,FALSE),INDIRECT($A77&\"_InLv\"),0)-1)","v":0},{"$f":"IF(ISNA(VLOOKUP($A77,'GPIO Configuration'!$B$4:$T$97,19,FALSE)),0,IF(VLOOKUP($A77,'GPIO Configuration'!$B$4:$T$97,19,FALSE)=\"1 - 使能\",1,0))","v":1},{"$f":"IF(ISNA(VLOOKUP($A77,'GPIO Configuration'!$B$4:$Q$97,16,FALSE)),0,IF(VLOOKUP($A77,'GPIO Configuration'!$B$4:$Q$97,16,FALSE)=\"上拉\",2,IF(VLOOKUP($A77,'GPIO Configuration'!$B$4:$Q$97,16,FALSE)=\"下拉\",1,0)))","v":0},{"$f":"IF(ISNA(VLOOKUP($A77,'GPIO Configuration'!$B$4:$O$97,14,FALSE)),0,MATCH(VLOOKUP($A77,'GPIO Configuration'!$B$4:$O$97,14,FALSE),INDIRECT($A77&\"_Func\"),0)-1)","v":0},{"$f":"IF(ISNA(VLOOKUP($A77,'GPIO Configuration'!$B$4:$P$97,15,FALSE)),0,MATCH(VLOOKUP($A77,'GPIO Configuration'!$B$4:$P$97,15,FALSE),INDIRECT($A77&\"_OutDrv\"),0)-1)","v":0}]
["P2_11",2,11,"0x004B","GPIO_PODR2_POD11","GPIO_PIDR2_PID11",{"$f":"IF(ISNA(VLOOKUP($A78,'GPIO Configuration'!$B$4:$C$97,2,FALSE)),0,1)","v":1},{"$f":"IF(ISNA(VLOOKUP($A78,'GPIO Configuration'!$B$4:$C$97,2,FALSE)),0,IF(VLOOKUP($A78,'GPIO Configuration'!$B$4:$C$97,2,FALSE)=\"是\",1,0))","v":0},{"$f":"IF(ISNA(VLOOKUP($A78,'GPIO Configuration'!$B$4:$D$97,3,FALSE)),\"\",TRIM(VLOOKUP($A78,'GPIO Configuration'!$B$4:$D$97,3,FALSE)))","v":""},{"$f":"IF(ISNA(VLOOKUP($A78,'GPIO Configuration'!$B$4:$E$97,4,FALSE)),0,IF(VLOOKUP($A78,'GPIO Configuration'!$B$4:$E$97,4,FALSE)=\"OUT - 输出\",1,0))","v":1},{"$f":"IF(ISNA(VLOOKUP($A78,'GPIO Configuration'!$B$4:$F$97,5,FALSE)),0,IF(VLOOKUP($A78,'GPIO Configuration'!$B$4:$F$97,5,FALSE)=\"1 - 高电平\",1,0))","v":1},{"$f":"IF(ISNA(VLOOKUP($A78,'GPIO Configuration'!$B$4:$K$97,10,FALSE)),0,IF(VLOOKUP($A78,'GPIO Configuration'!$B$4:$K$97,10,FALSE)=\"1 - 使能\",1,0))","v":0},{"$f":"IF(ISNA(VLOOKUP($A78,'GPIO Configuration'!$B$4:$J$97,9,FALSE)),0,MATCH(VLOOKUP($A78,'GPIO Configuration'!$B$4:$J$97,9,FALSE),INDIRECT($A78&\"_InLv\"),0)-1)","v":0},{"$f":"IF(ISNA(VLOOKUP($A78,'GPIO Configuration'!$B$4:$L$97,11,FALSE)),0,IF(VLOOKUP($A78,'GPIO Configuration'!$B$4:$L$97,11,FALSE)=\"1 - 使能\",1,0))","v":0},{"$f":"IF(ISNA(VLOOKUP($A78,'GPIO Configuration'!$B$4:$I$97,8,FALSE)),0,IF(VLOOKUP($A78,'GPIO Configuration'!$B$4:$I$97,8,FALSE)=\"上拉\",2,IF(VLOOKUP($A78,'GPIO Configuration'!$B$4:$I$97,8,FALSE)=\"下拉\",1,0)))","v":0},{"$f":"IF(ISNA(VLOOKUP($A78,'GPIO Configuration'!$B$4:$G$97,6,FALSE)),0,MATCH(VLOOKUP($A78,'GPIO Configuration'!$B$4:$G$97,6,FALSE),INDIRECT($A78&\"_Func\"),0)-1)","v":0},{"$f":"IF(ISNA(VLOOKUP($A78,'GPIO Configuration'!$B$4:$H$97,7,FALSE)),0,MATCH(VLOOKUP($A78,'GPIO Configuration'!$B$4:$H$97,7,FALSE),INDIRECT($A78&\"_OutDrv\"),0)-1)","v":3},{"$f":"IF(ISNA(VLOOKUP($A78,'GPIO Configuration'!$B$4:$M$97,12,FALSE)),0,IF(VLOOKUP($A78,'GPIO Configuration'!$B$4:$M$97,12,FALSE)=\"OUT - 输出\",1,0))","v":1},{"$f":"IF(ISNA(VLOOKUP($A78,'GPIO Configuration'!$B$4:$N$97,13,FALSE)),0,IF(VLOOKUP($A78,'GPIO Configuration'!$B$4:$N$97,13,FALSE)=\"1 - 高电平\",1,0))","v":0},{"$f":"IF(ISNA(VLOOKUP($A78,'GPIO Configuration'!$B$4:$S$97,18,FALSE)),0,IF(VLOOKUP($A78,'GPIO Configuration'!$B$4:$S$97,18,FALSE)=\"1 - 使能\",1,0))","v":0},{"$f":"IF(ISNA(VLOOKUP($A78,'GPIO Configuration'!$B$4:$R$97,17,FALSE)),0,MATCH(VLOOKUP($A78,'GPIO Configuration'!$B$4:$R$97,17,FALSE),INDIRECT($A78&\"_InLv\"),0)-1)","v":0},{"$f":"IF(ISNA(VLOOKUP($A78,'GPIO Configuration'!$B$4:$T$97,19,FALSE)),0,IF(VLOOKUP($A78,'GPIO Configuration'!$B$4:$T$97,19,FALSE)=\"1 - 使能\",1,0))","v":1},{"$f":"IF(ISNA(VLOOKUP($A78,'GPIO Configuration'!$B$4:$Q$97,16,FALSE)),0,IF(VLOOKUP($A78,'GPIO Configuration'!$B$4:$Q$97,16,FALSE)=\"上拉\",2,IF(VLOOKUP($A78,'GPIO Configuration'!$B$4:$Q$97,16,FALSE)=\"下拉\",1,0)))","v":0},{"$f":"IF(ISNA(VLOOKUP($A78,'GPIO Configuration'!$B$4:$O$97,14,FALSE)),0,MATCH(VLOOKUP($A78,'GPIO Configuration'!$B$4:$O$97,14,FALSE),INDIRECT($A78&\"_Func\"),0)-1)","v":0},{"$f":"IF(ISNA(VLOOKUP($A78,'GPIO Configuration'!$B$4:$P$97,15,FALSE)),0,MATCH(VLOOKUP($A78,'GPIO Configuration'!$B$4:$P$97,15,FALSE),INDIRECT($A78&\"_OutDrv\"),0)-1)","v":0}]
["P2_12",2,12,"0x004C","GPIO_PODR2_POD12","GPIO_PIDR2_PID12",{"$f":"IF(ISNA(VLOOKUP($A79,'GPIO Configuration'!$B$4:$C$97,2,FALSE)),0,1)","v":1},{"$f":"IF(ISNA(VLOOKUP($A79,'GPIO Configuration'!$B$4:$C$97,2,FALSE)),0,IF(VLOOKUP($A79,'GPIO Configuration'!$B$4:$C$97,2,FALSE)=\"是\",1,0))","v":0},{"$f":"IF(ISNA(VLOOKUP($A79,'GPIO Configuration'!$B$4:$D$97,3,FALSE)),\"\",TRIM(VLOOKUP($A79,'GPIO Configuration'!$B$4:$D$97,3,FALSE)))","v":""},{"$f":"IF(ISNA(VLOOKUP($A79,'GPIO Configuration'!$B$4:$E$97,4,FALSE)),0,IF(VLOOKUP($A79,'GPIO Configuration'!$B$4:$E$97,4,FALSE)=\"OUT - 输出\",1,0))","v":1},{"$f":"IF(ISNA(VLOOKUP($A79,'GPIO Configuration'!$B$4:$F$97,5,FALSE)),0,IF(VLOOKUP($A79,'GPIO Configuration'!$B$4:$F$97,5,FALSE)=\"1 - 高电平\",1,0))","v":0},{"$f":"IF(ISNA(VLOOKUP($A79,'GPIO Configuration'!$B$4:$K$97,10,FALSE)),0,IF(VLOOKUP($A79,'GPIO Configuration'!$B$4:$K$97,10,FALSE)=\"1 - 使能\",1,0))","v":0},{"$f":"IF(ISNA(VLOOKUP($A79,'GPIO Configuration'!$B$4:$J$97,9,FALSE)),0,MATCH(VLOOKUP($A79,'GPIO Configuration'!$B$4:$J$97,9,FALSE),INDIRECT($A79&\"_InLv\"),0)-1)","v":0},{"$f":"IF(ISNA(VLOOKUP($A79,'GPIO Configuration'!$B$4:$L$97,11,FALSE)),0,IF(VLOOKUP($A79,'GPIO Configuration'!$B$4:$L$97,11,FALSE)=\"1 - 使能\",1,0))","v":0},{"$f":"IF(ISNA(VLOOKUP($A79,'GPIO Configuration'!$B$4:$I$97,8,FALSE)),0,IF(VLOOKUP($A79,'GPIO Configuration'!$B$4:$I$97,8,FALSE)=\"上拉\",2,IF(VLOOKUP($A79,'GPIO Configuration'!$B$4:$I$97,8,FALSE)=\"下拉\",1,0)))","v":0},{"$f":"IF(ISNA(VLOOKUP($A79,'GPIO Configuration'!$B$4:$G$97,6,FALSE)),0,MATCH(VLOOKUP($A79,'GPIO Configuration'!$B$4:$G$97,6,FALSE),INDIRECT($A79&\"_Func\"),0)-1)","v":0},{"$f":"IF(ISNA(VLOOKUP($A79,'GPIO Configuration'!$B$4:$H$97,7,FALSE)),0,MATCH(VLOOKUP($A79,'GPIO Configuration'!$B$4:$H$97,7,FALSE),INDIRECT($A79&\"_OutDrv\"),0)-1)","v":3},{"$f":"IF(ISNA(VLOOKUP($A79,'GPIO Configuration'!$B$4:$M$97,12,FALSE)),0,IF(VLOOKUP($A79,'GPIO Configuration'!$B$4:$M$97,12,FALSE)=\"OUT - 输出\",1,0))","v":1},{"$f":"IF(ISNA(VLOOKUP($A79,'GPIO Configuration'!$B$4:$N$97,13,FALSE)),0,IF(VLOOKUP($A79,'GPIO Configuration'!$B$4:$N$97,13,FALSE)=\"1 - 高电平\",1,0))","v":0},{"$f":"IF(ISNA(VLOOKUP($A79,'GPIO Configuration'!$B$4:$S$97,18,FALSE)),0,IF(VLOOKUP($A79,'GPIO Configuration'!$B$4:$S$97,18,FALSE)=\"1 - 使能\",1,0))","v":0},{"$f":"IF(ISNA(VLOOKUP($A79,'GPIO Configuration'!$B$4:$R$97,17,FALSE)),0,MATCH(VLOOKUP($A79,'GPIO Configuration'!$B$4:$R$97,17,FALSE),INDIRECT($A79&\"_InLv\"),0)-1)","v":0},{"$f":"IF(ISNA(VLOOKUP($A79,'GPIO Configuration'!$B$4:$T$97,19,FALSE)),0,IF(VLOOKUP($A79,'GPIO Configuration'!$B$4:$T$97,19,FALSE)=\"1 - 使能\",1,0))","v":1},{"$f":"IF(ISNA(VLOOKUP($A79,'GPIO Configuration'!$B$4:$Q$97,16,FALSE)),0,IF(VLOOKUP($A79,'GPIO Configuration'!$B$4:$Q$97,16,FALSE)=\"上拉\",2,IF(VLOOKUP($A79,'GPIO Configuration'!$B$4:$Q$97,16,FALSE)=\"下拉\",1,0)))","v":0},{"$f":"IF(ISNA(VLOOKUP($A79,'GPIO Configuration'!$B$4:$O$97,14,FALSE)),0,MATCH(VLOOKUP($A79,'GPIO Configuration'!$B$4:$O$97,14,FALSE),INDIRECT($A79&\"_Func\"),0)-1)","v":0},{"$f":"IF(ISNA(VLOOKUP($A79,'GPIO Configuration'!$B$4:$P$97,15,FALSE)),0,MATCH(VLOOKUP($A79,'GPIO Configuration'!$B$4:$P$97,15,FALSE),INDIRECT($A79&\"_OutDrv\"),0)-1)","v":0}]
["P2_13",2,13,"0x004D","GPIO_PODR2_POD13","GPIO_PIDR2_PID13",{"$f":"IF(ISNA(VLOOKUP($A80,'GPIO Configuration'!$B$4:$C$97,2,FALSE)),0,1)","v":1},{"$f":"IF(ISNA(VLOOKUP($A80,'GPIO Configuration'!$B$4:$C$97,2,FALSE)),0,IF(VLOOKUP($A80,'GPIO Configuration'!$B$4:$C$97,2,FALSE)=\"是\",1,0))","v":0},{"$f":"IF(ISNA(VLOOKUP($A80,'GPIO Configuration'!$B$4:$D$97,3,FALSE)),\"\",TRIM(VLOOKUP($A80,'GPIO Configuration'!$B$4:$D$97,3,FALSE)))","v":""},{"$f":"IF(ISNA(VLOOKUP($A80,'GPIO Configuration'!$B$4:$E$97,4,FALSE)),0,IF(VLOOKUP($A80,'GPIO Configuration'!$B$4:$E$97,4,FALSE)=\"OUT - 输出\",1,0))","v":1},{"$f":"IF(ISNA(VLOOKUP($A80,'GPIO Configuration'!$B$4:$F$97,5,FALSE)),0,IF(VLOOKUP($A80,'GPIO Configuration'!$B$4:$F$97,5,FALSE)=\"1 - 高电平\",1,0))","v":0},{"$f":"IF(ISNA(VLOOKUP($A80,'GPIO Configuration'!$B$4:$K$97,10,FALSE)),0,IF(VLOOKUP($A80,'GPIO Configuration'!$B$4:$K$97,10,FALSE)=\"1 - 使能\",1,0))","v":0},{"$f":"IF(ISNA(VLOOKUP($A80,'GPIO Configuration'!$B$4:$J$97,9,FALSE)),0,MATCH(VLOOKUP($A80,'GPIO Configuration'!$B$4:$J$97,9,FALSE),INDIRECT($A80&\"_InLv\"),0)-1)","v":0},{"$f":"IF(ISNA(VLOOKUP($A80,'GPIO Configuration'!$B$4:$L$97,11,FALSE)),0,IF(VLOOKUP($A80,'GPIO Configuration'!$B$4:$L$97,11,FALSE)=\"1 - 使能\",1,0))","v":0},{"$f":"IF(ISNA(VLOOKUP($A80,'GPIO Configuration'!$B$4:$I$97,8,FALSE)),0,IF(VLOOKUP($A80,'GPIO Configuration'!$B$4:$I$97,8,FALSE)=\"上拉\",2,IF(VLOOKUP($A80,'GPIO Configuration'!$B$4:$I$97,8,FALSE)=\"下拉\",1,0)))","v":0},{"$f":"IF(ISNA(VLOOKUP($A80,'GPIO Configuration'!$B$4:$G$97,6,FALSE)),0,MATCH(VLOOKUP($A80,'GPIO Configuration'!$B$4:$G$97,6,FALSE),INDIRECT($A80&\"_Func\"),0)-1)","v":0},{"$f":"IF(ISNA(VLOOKUP($A80,'GPIO Configuration'!$B$4:$H$97,7,FALSE)),0,MATCH(VLOOKUP($A80,'GPIO Configuration'!$B$4:$H$97,7,FALSE),INDIRECT($A80&\"_OutDrv\"),0)-1)","v":3},{"$f":"IF(ISNA(VLOOKUP($A80,'GPIO Configuration'!$B$4:$M$97,12,FALSE)),0,IF(VLOOKUP($A80,'GPIO Configuration'!$B$4:$M$97,12,FALSE)=\"OUT - 输出\",1,0))","v":1},{"$f":"IF(ISNA(VLOOKUP($A80,'GPIO Configuration'!$B$4:$N$97,13,FALSE)),0,IF(VLOOKUP($A80,'GPIO Configuration'!$B$4:$N$97,13,FALSE)=\"1 - 高电平\",1,0))","v":0},{"$f":"IF(ISNA(VLOOKUP($A80,'GPIO Configuration'!$B$4:$S$97,18,FALSE)),0,IF(VLOOKUP($A80,'GPIO Configuration'!$B$4:$S$97,18,FALSE)=\"1 - 使能\",1,0))","v":0},{"$f":"IF(ISNA(VLOOKUP($A80,'GPIO Configuration'!$B$4:$R$97,17,FALSE)),0,MATCH(VLOOKUP($A80,'GPIO Configuration'!$B$4:$R$97,17,FALSE),INDIRECT($A80&\"_InLv\"),0)-1)","v":0},{"$f":"IF(ISNA(VLOOKUP($A80,'GPIO Configuration'!$B$4:$T$97,19,FALSE)),0,IF(VLOOKUP($A80,'GPIO Configuration'!$B$4:$T$97,19,FALSE)=\"1 - 使能\",1,0))","v":1},{"$f":"IF(ISNA(VLOOKUP($A80,'GPIO Configuration'!$B$4:$Q$97,16,FALSE)),0,IF(VLOOKUP($A80,'GPIO Configuration'!$B$4:$Q$97,16,FALSE)=\"上拉\",2,IF(VLOOKUP($A80,'GPIO Configuration'!$B$4:$Q$97,16,FALSE)=\"下拉\",1,0)))","v":0},{"$f":"IF(ISNA(VLOOKUP($A80,'GPIO Configuration'!$B$4:$O$97,14,FALSE)),0,MATCH(VLOOKUP($A80,'GPIO Configuration'!$B$4:$O$97,14,FALSE),INDIRECT($A80&\"_Func\"),0)-1)","v":0},{"$f":"IF(ISNA(VLOOKUP($A80,'GPIO Configuration'!$B$4:$P$97,15,FALSE)),0,MATCH(VLOOKUP($A80,'GPIO Configuration'!$B$4:$P$97,15,FALSE),INDIRECT($A80&\"_OutDrv\"),0)-1)","v":0}]
["P2_14",2,14,"0x004E","GPIO_PODR2_POD14","GPIO_PIDR2_PID14",{"$f":"IF(ISNA(VLOOKUP($A81,'GPIO Configuration'!$B$4:$C$97,2,FALSE)),0,1)","v":1},{"$f":"IF(ISNA(VLOOKUP($A81,'GPIO Configuration'!$B$4:$C$97,2,FALSE)),0,IF(VLOOKUP($A81,'GPIO Configuration'!$B$4:$C$97,2,FALSE)=\"是\",1,0))","v":0},{"$f":"IF(ISNA(VLOOKUP($A81,'GPIO Configuration'!$B$4:$D$97,3,FALSE)),\"\",TRIM(VLOOKUP($A81,'GPIO Configuration'!$B$4:$D$97,3,FALSE)))","v":""},{"$f":"IF(ISNA(VLOOKUP($A81,'GPIO Configuration'!$B$4:$E$97,4,FALSE)),0,IF(VLOOKUP($A81,'GPIO Configuration'!$B$4:$E$97,4,FALSE)=\"OUT - 输出\",1,0))","v":1},{"$f":"IF(ISNA(VLOOKUP($A81,'GPIO Configuration'!$B$4:$F$97,5,FALSE)),0,IF(VLOOKUP($A81,'GPIO Configuration'!$B$4:$F$97,5,FALSE)=\"1 - 高电平\",1,0))","v":1},{"$f":"IF(ISNA(VLOOKUP($A81,'GPIO Configuration'!$B$4:$K$97,10,FALSE)),0,IF(VLOOKUP($A81,'GPIO Configuration'!$B$4:$K$97,10,FALSE)=\"1 - 使能\",1,0))","v":0},{"$f":"IF(ISNA(VLOOKUP($A81,'GPIO Configuration'!$B$4:$J$97,9,FALSE)),0,MATCH(VLOOKUP($A81,'GPIO Configuration'!$B$4:$J$97,9,FALSE),INDIRECT($A81&\"_InLv\"),0)-1)","v":0},{"$f":"IF(ISNA(VLOOKUP($A81,'GPIO Configuration'!$B$4:$L$97,11,FALSE)),0,IF(VLOOKUP($A81,'GPIO Configuration'!$B$4:$L$97,11,FALSE)=\"1 - 使能\",1,0))","v":1},{"$f":"IF(ISNA(VLOOKUP($A81,'GPIO Configuration'!$B$4:$I$97,8,FALSE)),0,IF(VLOOKUP($A81,'GPIO Configuration'!$B$4:$I$97,8,FALSE)=\"上拉\",2,IF(VLOOKUP($A81,'GPIO Configuration'!$B$4:$I$97,8,FALSE)=\"下拉\",1,0)))","v":0},{"$f":"IF(ISNA(VLOOKUP($A81,'GPIO Configuration'!$B$4:$G$97,6,FALSE)),0,MATCH(VLOOKUP($A81,'GPIO Configuration'!$B$4:$G$97,6,FALSE),INDIRECT($A81&\"_Func\"),0)-1)","v":0},{"$f":"IF(ISNA(VLOOKUP($A81,'GPIO Configuration'!$B$4:$H$97,7,FALSE)),0,MATCH(VLOOKUP($A81,'GPIO Configuration'!$B$4:$H$97,7,FALSE),INDIRECT($A81&\"_OutDrv\"),0)-1)","v":3},{"$f":"IF(ISNA(VLOOKUP($A81,'GPIO Configuration'!$B$4:$M$97,12,FALSE)),0,IF(VLOOKUP($A81,'GPIO Configuration'!$B$4:$M$97,12,FALSE)=\"OUT - 输出\",1,0))","v":1},{"$f":"IF(ISNA(VLOOKUP($A81,'GPIO Configuration'!$B$4:$N$97,13,FALSE)),0,IF(VLOOKUP($A81,'GPIO Configuration'!$B$4:$N$97,13,FALSE)=\"1 - 高电平\",1,0))","v":0},{"$f":"IF(ISNA(VLOOKUP($A81,'GPIO Configuration'!$B$4:$S$97,18,FALSE)),0,IF(VLOOKUP($A81,'GPIO Configuration'!$B$4:$S$97,18,FALSE)=\"1 - 使能\",1,0))","v":0},{"$f":"IF(ISNA(VLOOKUP($A81,'GPIO Configuration'!$B$4:$R$97,17,FALSE)),0,MATCH(VLOOKUP($A81,'GPIO Configuration'!$B$4:$R$97,17,FALSE),INDIRECT($A81&\"_InLv\"),0)-1)","v":0},{"$f":"IF(ISNA(VLOOKUP($A81,'GPIO Configuration'!$B$4:$T$97,19,FALSE)),0,IF(VLOOKUP($A81,'GPIO Configuration'!$B$4:$T$97,19,FALSE)=\"1 - 使能\",1,0))","v":1},{"$f":"IF(ISNA(VLOOKUP($A81,'GPIO Configuration'!$B$4:$Q$97,16,FALSE)),0,IF(VLOOKUP($A81,'GPIO Configuration'!$B$4:$Q$97,16,FALSE)=\"上拉\",2,IF(VLOOKUP($A81,'GPIO Configuration'!$B$4:$Q$97,16,FALSE)=\"下拉\",1,0)))","v":0},{"$f":"IF(ISNA(VLOOKUP($A81,'GPIO Configuration'!$B$4:$O$97,14,FALSE)),0,MATCH(VLOOKUP($A81,'GPIO Configuration'!$B$4:$O$97,14,FALSE),INDIRECT($A81&\"_Func\"),0)-1)","v":0},{"$f":"IF(ISNA(VLOOKUP($A81,'GPIO Configuration'!$B$4:$P$97,15,FALSE)),0,MATCH(VLOOKUP($A81,'GPIO Configuration'!$B$4:$P$97,15,FALSE),INDIRECT($A81&\"_OutDrv\"),0)-1)","v":0}]
["P2_15",2,15,"0x004F","GPIO_PODR2_POD15","GPIO_PIDR2_PID15",{"$f":"IF(ISNA(VLOOKUP($A82,'GPIO Configuration'!$B$4:$C$97,2,FALSE)),0,1)","v":1},{"$f":"IF(ISNA(VLOOKUP($A82,'GPIO Configuration'!$B$4:$C$97,2,FALSE)),0,IF(VLOOKUP($A82,'GPIO Configuration'!$B$4:$C$97,2,FALSE)=\"是\",1,0))","v":0},{"$f":"IF(ISNA(VLOOKUP($A82,'GPIO Configuration'!$B$4:$D$97,3,FALSE)),\"\",TRIM(VLOOKUP($A82,'GPIO Configuration'!$B$4:$D$97,3,FALSE)))","v":""},{"$f":"IF(ISNA(VLOOKUP($A82,'GPIO Configuration'!$B$4:$E$97,4,FALSE)),0,IF(VLOOKUP($A82,'GPIO Configuration'!$B$4:$E$97,4,FALSE)=\"OUT - 输出\",1,0))","v":1},{"$f":"IF(ISNA(VLOOKUP($A82,'GPIO Configuration'!$B$4:$F$97,5,FALSE)),0,IF(VLOOKUP($A82,'GPIO Configuration'!$B$4:$F$97,5,FALSE)=\"1 - 高电平\",1,0))","v":1},{"$f":"IF(ISNA(VLOOKUP($A82,'GPIO Configuration'!$B$4:$K$97,10,FALSE)),0,IF(VLOOKUP($A82,'GPIO Configuration'!$B$4:$K$97,10,FALSE)=\"1 - 使能\",1,0))","v":0},{"$f":"IF(ISNA(VLOOKUP($A82,'GPIO Configuration'!$B$4:$J$97,9,FALSE)),0,MATCH(VLOOKUP($A82,'GPIO Configuration'!$B$4:$J$97,9,FALSE),INDIRECT($A82&\"_InLv\"),0)-1)","v":0},{"$f":"IF(ISNA(VLOOKUP($A82,'GPIO Configuration'!$B$4:$L$97,11,FALSE)),0,IF(VLOOKUP($A82,'GPIO Configuration'!$B$4:$L$97,11,FALSE)=\"1 - 使能\",1,0))","v":1},{"$f":"IF(ISNA(VLOOKUP($A82,'GPIO Configuration'!$B$4:$I$97,8,FALSE)),0,IF(VLOOKUP($A82,'GPIO Configuration'!$B$4:$I$97,8,FALSE)=\"上拉\",2,IF(VLOOKUP($A82,'GPIO Configuration'!$B$4:$I$97,8,FALSE)=\"下拉\",1,0)))","v":0},{"$f":"IF(ISNA(VLOOKUP($A82,'GPIO Configuration'!$B$4:$G$97,6,FALSE)),0,MATCH(VLOOKUP($A82,'GPIO Configuration'!$B$4:$G$97,6,FALSE),INDIRECT($A82&\"_Func\"),0)-1)","v":0},{"$f":"IF(ISNA(VLOOKUP($A82,'GPIO Configuration'!$B$4:$H$97,7,FALSE)),0,MATCH(VLOOKUP($A82,'GPIO Configuration'!$B$4:$H$97,7,FALSE),INDIRECT($A82&\"_OutDrv\"),0)-1)","v":3},{"$f":"IF(ISNA(VLOOKUP($A82,'GPIO Configuration'!$B$4:$M$97,12,FALSE)),0,IF(VLOOKUP($A82,'GPIO Configuration'!$B$4:$M$97,12,FALSE)=\"OUT - 输出\",1,0))","v":1},{"$f":"IF(ISNA(VLOOKUP($A82,'GPIO Configuration'!$B$4:$N$97,13,FALSE)),0,IF(VLOOKUP($A82,'GPIO Configuration'!$B$4:$N$97,13,FALSE)=\"1 - 高电平\",1,0))","v":0},{"$f":"IF(ISNA(VLOOKUP($A82,'GPIO Configuration'!$B$4:$S$97,18,FALSE)),0,IF(VLOOKUP($A82,'GPIO Configuration'!$B$4:$S$97,18,FALSE)=\"1 - 使能\",1,0))","v":0},{"$f":"IF(ISNA(VLOOKUP($A82,'GPIO Configuration'!$B$4:$R$97,17,FALSE)),0,MATCH(VLOOKUP($A82,'GPIO Configuration'!$B$4:$R$97,17,FALSE),INDIRECT($A82&\"_InLv\"),0)-1)","v":0},{"$f":"IF(ISNA(VLOOKUP($A82,'GPIO Configuration'!$B$4:$T$97,19,FALSE)),0,IF(VLOOKUP($A82,'GPIO Configuration'!$B$4:$T$97,19,FALSE)=\"1 - 使能\",1,0))","v":1},{"$f":"IF(ISNA(VLOOKUP($A82,'GPIO Configuration'!$B$4:$Q$97,16,FALSE)),0,IF(VLOOKUP($A82,'GPIO Configuration'!$B$4:$Q$97,16,FALSE)=\"上拉\",2,IF(VLOOKUP($A82,'GPIO Configuration'!$B$4:$Q$97,16,FALSE)=\"下拉\",1,0)))","v":0},{"$f":"IF(ISNA(VLOOKUP($A82,'GPIO Configuration'!$B$4:$O$97,14,FALSE)),0,MATCH(VLOOKUP($A82,'GPIO Configuration'!$B$4:$O$97,14,FALSE),INDIRECT($A82&\"_Func\"),0)-1)","v":0},{"$f":"IF(ISNA(VLOOKUP($A82,'GPIO Configuration'!$B$4:$P$97,15,FALSE)),0,MATCH(VLOOKUP($A82,'GPIO Configuration'!$B$4:$P$97,15,FALSE),INDIRECT($A82&\"_OutDrv\"),0)-1)","v":0}]
["P2_16",2,16,"0x0050","GPIO_PODR2_POD16","GPIO_PIDR2_PID16",{"$f":"IF(ISNA(VLOOKUP($A83,'GPIO Configuration'!$B$4:$C$97,2,FALSE)),0,1)","v":1},{"$f":"IF(ISNA(VLOOKUP($A83,'GPIO Configuration'!$B$4:$C$97,2,FALSE)),0,IF(VLOOKUP($A83,'GPIO Configuration'!$B$4:$C$97,2,FALSE)=\"是\",1,0))","v":0},{"$f":"IF(ISNA(VLOOKUP($A83,'GPIO Configuration'!$B$4:$D$97,3,FALSE)),\"\",TRIM(VLOOKUP($A83,'GPIO Configuration'!$B$4:$D$97,3,FALSE)))","v":""},{"$f":"IF(ISNA(VLOOKUP($A83,'GPIO Configuration'!$B$4:$E$97,4,FALSE)),0,IF(VLOOKUP($A83,'GPIO Configuration'!$B$4:$E$97,4,FALSE)=\"OUT - 输出\",1,0))","v":1},{"$f":"IF(ISNA(VLOOKUP($A83,'GPIO Configuration'!$B$4:$F$97,5,FALSE)),0,IF(VLOOKUP($A83,'GPIO Configuration'!$B$4:$F$97,5,FALSE)=\"1 - 高电平\",1,0))","v":1},{"$f":"IF(ISNA(VLOOKUP($A83,'GPIO Configuration'!$B$4:$K$97,10,FALSE)),0,IF(VLOOKUP($A83,'GPIO Configuration'!$B$4:$K$97,10,FALSE)=\"1 - 使能\",1,0))","v":0},{"$f":"IF(ISNA(VLOOKUP($A83,'GPIO Configuration'!$B$4:$J$97,9,FALSE)),0,MATCH(VLOOKUP($A83,'GPIO Configuration'!$B$4:$J$97,9,FALSE),INDIRECT($A83&\"_InLv\"),0)-1)","v":0},{"$f":"IF(ISNA(VLOOKUP($A83,'GPIO Configuration'!$B$4:$L$97,11,FALSE)),0,IF(VLOOKUP($A83,'GPIO Configuration'!$B$4:$L$97,11,FALSE)=\"1 - 使能\",1,0))","v":1},{"$f":"IF(ISNA(VLOOKUP($A83,'GPIO Configuration'!$B$4:$I$97,8,FALSE)),0,IF(VLOOKUP($A83,'GPIO Configuration'!$B$4:$I$97,8,FALSE)=\"上拉\",2,IF(VLOOKUP($A83,'GPIO Configuration'!$B$4:$I$97,8,FALSE)=\"下拉\",1,0)))","v":0},{"$f":"IF(ISNA(VLOOKUP($A83,'GPIO Configuration'!$B$4:$G$97,6,FALSE)),0,MATCH(VLOOKUP($A83,'GPIO Configuration'!$B$4:$G$97,6,FALSE),INDIRECT($A83&\"_Func\"),0)-1)","v":0},{"$f":"IF(ISNA(VLOOKUP($A83,'GPIO Configuration'!$B$4:$H$97,7,FALSE)),0,MATCH(VLOOKUP($A83,'GPIO Configuration'!$B$4:$H$97,7,FALSE),INDIRECT($A83&\"_OutDrv\"),0)-1)","v":3},{"$f":"IF(ISNA(VLOOKUP($A83,'GPIO Configuration'!$B$4:$M$97,12,FALSE)),0,IF(VLOOKUP($A83,'GPIO Configuration'!$B$4:$M$97,12,FALSE)=\"OUT - 输出\",1,0))","v":1},{"$f":"IF(ISNA(VLOOKUP($A83,'GPIO Configuration'!$B$4:$N$97,13,FALSE)),0,IF(VLOOKUP($A83,'GPIO Configuration'!$B$4:$N$97,13,FALSE)=\"1 - 高电平\",1,0))","v":0},{"$f":"IF(ISNA(VLOOKUP($A83,'GPIO Configuration'!$B$4:$S$97,18,FALSE)),0,IF(VLOOKUP($A83,'GPIO Configuration'!$B$4:$S$97,18,FALSE)=\"1 - 使能\",1,0))","v":0},{"$f":"IF(ISNA(VLOOKUP($A83,'GPIO Configuration'!$B$4:$R$97,17,FALSE)),0,MATCH(VLOOKUP($A83,'GPIO Configuration'!$B$4:$R$97,17,FALSE),INDIRECT($A83&\"_InLv\"),0)-1)","v":0},{"$f":"IF(ISNA(VLOOKUP($A83,'GPIO Configuration'!$B$4:$T$97,19,FALSE)),0,IF(VLOOKUP($A83,'GPIO Configuration'!$B$4:$T$97,19,FALSE)=\"1 - 使能\",1,0))","v":1},{"$f":"IF(ISNA(VLOOKUP($A83,'GPIO Configuration'!$B$4:$Q$97,16,FALSE)),0,IF(VLOOKUP($A83,'GPIO Configuration'!$B$4:$Q$97,16,FALSE)=\"上拉\",2,IF(VLOOKUP($A83,'GPIO Configuration'!$B$4:$Q$97,16,FALSE)=\"下拉\",1,0)))","v":0},{"$f":"IF(ISNA(VLOOKUP($A83,'GPIO Configuration'!$B$4:$O$97,14,FALSE)),0,MATCH(VLOOKUP($A83,'GPIO Configuration'!$B$4:$O$97,14,FALSE),INDIRECT($A83&\"_Func\"),0)-1)","v":0},{"$f":"IF(ISNA(VLOOKUP($A83,'GPIO Configuration'!$B$4:$P$97,15,FALSE)),0,MATCH(VLOOKUP($A83,'GPIO Configuration'!$B$4:$P$97,15,FALSE),INDIRECT($A83&\"_OutDrv\"),0)-1)","v":0}]
["P2_17",2,17,"0x0051","GPIO_PODR2_POD17","GPIO_PIDR2_PID17",{"$f":"IF(ISNA(VLOOKUP($A84,'GPIO Configuration'!$B$4:$C$97,2,FALSE)),0,1)","v":1},{"$f":"IF(ISNA(VLOOKUP($A84,'GPIO Configuration'!$B$4:$C$97,2,FALSE)),0,IF(VLOOKUP($A84,'GPIO Configuration'!$B$4:$C$97,2,FALSE)=\"是\",1,0))","v":0},{"$f":"IF(ISNA(VLOOKUP($A84,'GPIO Configuration'!$B$4:$D$97,3,FALSE)),\"\",TRIM(VLOOKUP($A84,'GPIO Configuration'!$B$4:$D$97,3,FALSE)))","v":""},{"$f":"IF(ISNA(VLOOKUP($A84,'GPIO Configuration'!$B$4:$E$97,4,FALSE)),0,IF(VLOOKUP($A84,'GPIO Configuration'!$B$4:$E$97,4,FALSE)=\"OUT - 输出\",1,0))","v":1},{"$f":"IF(ISNA(VLOOKUP($A84,'GPIO Configuration'!$B$4:$F$97,5,FALSE)),0,IF(VLOOKUP($A84,'GPIO Configuration'!$B$4:$F$97,5,FALSE)=\"1 - 高电平\",1,0))","v":1},{"$f":"IF(ISNA(VLOOKUP($A84,'GPIO Configuration'!$B$4:$K$97,10,FALSE)),0,IF(VLOOKUP($A84,'GPIO Configuration'!$B$4:$K$97,10,FALSE)=\"1 - 使能\",1,0))","v":0},{"$f":"IF(ISNA(VLOOKUP($A84,'GPIO Configuration'!$B$4:$J$97,9,FALSE)),0,MATCH(VLOOKUP($A84,'GPIO Configuration'!$B$4:$J$97,9,FALSE),INDIRECT($A84&\"_InLv\"),0)-1)","v":0},{"$f":"IF(ISNA(VLOOKUP($A84,'GPIO Configuration'!$B$4:$L$97,11,FALSE)),0,IF(VLOOKUP($A84,'GPIO Configuration'!$B$4:$L$97,11,FALSE)=\"1 - 使能\",1,0))","v":1},{"$f":"IF(ISNA(VLOOKUP($A84,'GPIO Configuration'!$B$4:$I$97,8,FALSE)),0,IF(VLOOKUP($A84,'GPIO Configuration'!$B$4:$I$97,8,FALSE)=\"上拉\",2,IF(VLOOKUP($A84,'GPIO Configuration'!$B$4:$I$97,8,FALSE)=\"下拉\",1,0)))","v":0},{"$f":"IF(ISNA(VLOOKUP($A84,'GPIO Configuration'!$B$4:$G$97,6,FALSE)),0,MATCH(VLOOKUP($A84,'GPIO Configuration'!$B$4:$G$97,6,FALSE),INDIRECT($A84&\"_Func\"),0)-1)","v":0},{"$f":"IF(ISNA(VLOOKUP($A84,'GPIO Configuration'!$B$4:$H$97,7,FALSE)),0,MATCH(VLOOKUP($A84,'GPIO Configuration'!$B$4:$H$97,7,FALSE),INDIRECT($A84&\"_OutDrv\"),0)-1)","v":3},{"$f":"IF(ISNA(VLOOKUP($A84,'GPIO Configuration'!$B$4:$M$97,12,FALSE)),0,IF(VLOOKUP($A84,'GPIO Configuration'!$B$4:$M$97,12,FALSE)=\"OUT - 输出\",1,0))","v":1},{"$f":"IF(ISNA(VLOOKUP($A84,'GPIO Configuration'!$B$4:$N$97,13,FALSE)),0,IF(VLOOKUP($A84,'GPIO Configuration'!$B$4:$N$97,13,FALSE)=\"1 - 高电平\",1,0))","v":0},{"$f":"IF(ISNA(VLOOKUP($A84,'GPIO Configuration'!$B$4:$S$97,18,FALSE)),0,IF(VLOOKUP($A84,'GPIO Configuration'!$B$4:$S$97,18,FALSE)=\"1 - 使能\",1,0))","v":0},{"$f":"IF(ISNA(VLOOKUP($A84,'GPIO Configuration'!$B$4:$R$97,17,FALSE)),0,MATCH(VLOOKUP($A84,'GPIO Configuration'!$B$4:$R$97,17,FALSE),INDIRECT($A84&\"_InLv\"),0)-1)","v":0},{"$f":"IF(ISNA(VLOOKUP($A84,'GPIO Configuration'!$B$4:$T$97,19,FALSE)),0,IF(VLOOKUP($A84,'GPIO Configuration'!$B$4:$T$97,19,FALSE)=\"1 - 使能\",1,0))","v":1},{"$f":"IF(ISNA(VLOOKUP($A84,'GPIO Configuration'!$B$4:$Q$97,16,FALSE)),0,IF(VLOOKUP($A84,'GPIO Configuration'!$B$4:$Q$97,16,FALSE)=\"上拉\",2,IF(VLOOKUP($A84,'GPIO Configuration'!$B$4:$Q$97,16,FALSE)=\"下拉\",1,0)))","v":0},{"$f":"IF(ISNA(VLOOKUP($A84,'GPIO Configuration'!$B$4:$O$97,14,FALSE)),0,MATCH(VLOOKUP($A84,'GPIO Configuration'!$B$4:$O$97,14,FALSE),INDIRECT($A84&\"_Func\"),0)-1)","v":0},{"$f":"IF(ISNA(VLOOKUP($A84,'GPIO Configuration'!$B$4:$P$97,15,FALSE)),0,MATCH(VLOOKUP($A84,'GPIO Configuration'!$B$4:$P$97,15,FALSE),INDIRECT($A84&\"_OutDrv\"),0)-1)","v":0}]
["P2_18",2,18,"0x0052","GPIO_PODR2_POD18","GPIO_PIDR2_PID18",{"$f":"IF(ISNA(VLOOKUP($A85,'GPIO Configuration'!$B$4:$C$97,2,FALSE)),0,1)","v":1},{"$f":"IF(ISNA(VLOOKUP($A85,'GPIO Configuration'!$B$4:$C$97,2,FALSE)),0,IF(VLOOKUP($A85,'GPIO Configuration'!$B$4:$C$97,2,FALSE)=\"是\",1,0))","v":0},{"$f":"IF(ISNA(VLOOKUP($A85,'GPIO Configuration'!$B$4:$D$97,3,FALSE)),\"\",TRIM(VLOOKUP($A85,'GPIO Configuration'!$B$4:$D$97,3,FALSE)))","v":""},{"$f":"IF(ISNA(VLOOKUP($A85,'GPIO Configuration'!$B$4:$E$97,4,FALSE)),0,IF(VLOOKUP($A85,'GPIO Configuration'!$B$4:$E$97,4,FALSE)=\"OUT - 输出\",1,0))","v":1},{"$f":"IF(ISNA(VLOOKUP($A85,'GPIO Configuration'!$B$4:$F$97,5,FALSE)),0,IF(VLOOKUP($A85,'GPIO Configuration'!$B$4:$F$97,5,FALSE)=\"1 - 高电平\",1,0))","v":1},{"$f":"IF(ISNA(VLOOKUP($A85,'GPIO Configuration'!$B$4:$K$97,10,FALSE)),0,IF(VLOOKUP($A85,'GPIO Configuration'!$B$4:$K$97,10,FALSE)=\"1 - 使能\",1,0))","v":0},{"$f":"IF(ISNA(VLOOKUP($A85,'GPIO Configuration'!$B$4:$J$97,9,FALSE)),0,MATCH(VLOOKUP($A85,'GPIO Configuration'!$B$4:$J$97,9,FALSE),INDIRECT($A85&\"_InLv\"),0)-1)","v":0},{"$f":"IF(ISNA(VLOOKUP($A85,'GPIO Configuration'!$B$4:$L$97,11,FALSE)),0,IF(VLOOKUP($A85,'GPIO Configuration'!$B$4:$L$97,11,FALSE)=\"1 - 使能\",1,0))","v":1},{"$f":"IF(ISNA(VLOOKUP($A85,'GPIO Configuration'!$B$4:$I$97,8,FALSE)),0,IF(VLOOKUP($A85,'GPIO Configuration'!$B$4:$I$97,8,FALSE)=\"上拉\",2,IF(VLOOKUP($A85,'GPIO Configuration'!$B$4:$I$97,8,FALSE)=\"下拉\",1,0)))","v":0},{"$f":"IF(ISNA(VLOOKUP($A85,'GPIO Configuration'!$B$4:$G$97,6,FALSE)),0,MATCH(VLOOKUP($A85,'GPIO Configuration'!$B$4:$G$97,6,FALSE),INDIRECT($A85&\"_Func\"),0)-1)","v":0},{"$f":"IF(ISNA(VLOOKUP($A85,'GPIO Configuration'!$B$4:$H$97,7,FALSE)),0,MATCH(VLOOKUP($A85,'GPIO Configuration'!$B$4:$H$97,7,FALSE),INDIRECT($A85&\"_OutDrv\"),0)-1)","v":3},{"$f":"IF(ISNA(VLOOKUP($A85,'GPIO Configuration'!$B$4:$M$97,12,FALSE)),0,IF(VLOOKUP($A85,'GPIO Configuration'!$B$4:$M$97,12,FALSE)=\"OUT - 输出\",1,0))","v":1},{"$f":"IF(ISNA(VLOOKUP($A85,'GPIO Configuration'!$B$4:$N$97,13,FALSE)),0,IF(VLOOKUP($A85,'GPIO Configuration'!$B$4:$N$97,13,FALSE)=\"1 - 高电平\",1,0))","v":0},{"$f":"IF(ISNA(VLOOKUP($A85,'GPIO Configuration'!$B$4:$S$97,18,FALSE)),0,IF(VLOOKUP($A85,'GPIO Configuration'!$B$4:$S$97,18,FALSE)=\"1 - 使能\",1,0))","v":0},{"$f":"IF(ISNA(VLOOKUP($A85,'GPIO Configuration'!$B$4:$R$97,17,FALSE)),0,MATCH(VLOOKUP($A85,'GPIO Configuration'!$B$4:$R$97,17,FALSE),INDIRECT($A85&\"_InLv\"),0)-1)","v":0},{"$f":"IF(ISNA(VLOOKUP($A85,'GPIO Configuration'!$B$4:$T$97,19,FALSE)),0,IF(VLOOKUP($A85,'GPIO Configuration'!$B$4:$T$97,19,FALSE)=\"1 - 使能\",1,0))","v":1},{"$f":"IF(ISNA(VLOOKUP($A85,'GPIO Configuration'!$B$4:$Q$97,16,FALSE)),0,IF(VLOOKUP($A85,'GPIO Configuration'!$B$4:$Q$97,16,FALSE)=\"上拉\",2,IF(VLOOKUP($A85,'GPIO Configuration'!$B$4:$Q$97,16,FALSE)=\"下拉\",1,0)))","v":0},{"$f":"IF(ISNA(VLOOKUP($A85,'GPIO Configuration'!$B$4:$O$97,14,FALSE)),0,MATCH(VLOOKUP($A85,'GPIO Configuration'!$B$4:$O$97,14,FALSE),INDIRECT($A85&\"_Func\"),0)-1)","v":0},{"$f":"IF(ISNA(VLOOKUP($A85,'GPIO Configuration'!$B$4:$P$97,15,FALSE)),0,MATCH(VLOOKUP($A85,'GPIO Configuration'!$B$4:$P$97,15,FALSE),INDIRECT($A85&\"_OutDrv\"),0)-1)","v":0}]
["P2_19",2,19,"0x0053","GPIO_PODR2_POD19","GPIO_PIDR2_PID19",{"$f":"IF(ISNA(VLOOKUP($A86,'GPIO Configuration'!$B$4:$C$97,2,FALSE)),0,1)","v":1},{"$f":"IF(ISNA(VLOOKUP($A86,'GPIO Configuration'!$B$4:$C$97,2,FALSE)),0,IF(VLOOKUP($A86,'GPIO Configuration'!$B$4:$C$97,2,FALSE)=\"是\",1,0))","v":0},{"$f":"IF(ISNA(VLOOKUP($A86,'GPIO Configuration'!$B$4:$D$97,3,FALSE)),\"\",TRIM(VLOOKUP($A86,'GPIO Configuration'!$B$4:$D$97,3,FALSE)))","v":""},{"$f":"IF(ISNA(VLOOKUP($A86,'GPIO Configuration'!$B$4:$E$97,4,FALSE)),0,IF(VLOOKUP($A86,'GPIO Configuration'!$B$4:$E$97,4,FALSE)=\"OUT - 输出\",1,0))","v":1},{"$f":"IF(ISNA(VLOOKUP($A86,'GPIO Configuration'!$B$4:$F$97,5,FALSE)),0,IF(VLOOKUP($A86,'GPIO Configuration'!$B$4:$F$97,5,FALSE)=\"1 - 高电平\",1,0))","v":0},{"$f":"IF(ISNA(VLOOKUP($A86,'GPIO Configuration'!$B$4:$K$97,10,FALSE)),0,IF(VLOOKUP($A86,'GPIO Configuration'!$B$4:$K$97,10,FALSE)=\"1 - 使能\",1,0))","v":0},{"$f":"IF(ISNA(VLOOKUP($A86,'GPIO Configuration'!$B$4:$J$97,9,FALSE)),0,MATCH(VLOOKUP($A86,'GPIO Configuration'!$B$4:$J$97,9,FALSE),INDIRECT($A86&\"_InLv\"),0)-1)","v":0},{"$f":"IF(ISNA(VLOOKUP($A86,'GPIO Configuration'!$B$4:$L$97,11,FALSE)),0,IF(VLOOKUP($A86,'GPIO Configuration'!$B$4:$L$97,11,FALSE)=\"1 - 使能\",1,0))","v":1},{"$f":"IF(ISNA(VLOOKUP($A86,'GPIO Configuration'!$B$4:$I$97,8,FALSE)),0,IF(VLOOKUP($A86,'GPIO Configuration'!$B$4:$I$97,8,FALSE)=\"上拉\",2,IF(VLOOKUP($A86,'GPIO Configuration'!$B$4:$I$97,8,FALSE)=\"下拉\",1,0)))","v":0},{"$f":"IF(ISNA(VLOOKUP($A86,'GPIO Configuration'!$B$4:$G$97,6,FALSE)),0,MATCH(VLOOKUP($A86,'GPIO Configuration'!$B$4:$G$97,6,FALSE),INDIRECT($A86&\"_Func\"),0)-1)","v":0},{"$f":"IF(ISNA(VLOOKUP($A86,'GPIO Configuration'!$B$4:$H$97,7,FALSE)),0,MATCH(VLOOKUP($A86,'GPIO Configuration'!$B$4:$H$97,7,FALSE),INDIRECT($A86&\"_OutDrv\"),0)-1)","v":3},{"$f":"IF(ISNA(VLOOKUP($A86,'GPIO Configuration'!$B$4:$M$97,12,FALSE)),0,IF(VLOOKUP($A86,'GPIO Configuration'!$B$4:$M$97,12,FALSE)=\"OUT - 输出\",1,0))","v":1},{"$f":"IF(ISNA(VLOOKUP($A86,'GPIO Configuration'!$B$4:$N$97,13,FALSE)),0,IF(VLOOKUP($A86,'GPIO Configuration'!$B$4:$N$97,13,FALSE)=\"1 - 高电平\",1,0))","v":0},{"$f":"IF(ISNA(VLOOKUP($A86,'GPIO Configuration'!$B$4:$S$97,18,FALSE)),0,IF(VLOOKUP($A86,'GPIO Configuration'!$B$4:$S$97,18,FALSE)=\"1 - 使能\",1,0))","v":0},{"$f":"IF(ISNA(VLOOKUP($A86,'GPIO Configuration'!$B$4:$R$97,17,FALSE)),0,MATCH(VLOOKUP($A86,'GPIO Configuration'!$B$4:$R$97,17,FALSE),INDIRECT($A86&\"_InLv\"),0)-1)","v":0},{"$f":"IF(ISNA(VLOOKUP($A86,'GPIO Configuration'!$B$4:$T$97,19,FALSE)),0,IF(VLOOKUP($A86,'GPIO Configuration'!$B$4:$T$97,19,FALSE)=\"1 - 使能\",1,0))","v":1},{"$f":"IF(ISNA(VLOOKUP($A86,'GPIO Configuration'!$B$4:$Q$97,16,FALSE)),0,IF(VLOOKUP($A86,'GPIO Configuration'!$B$4:$Q$97,16,FALSE)=\"上拉\",2,IF(VLOOKUP($A86,'GPIO Configuration'!$B$4:$Q$97,16,FALSE)=\"下拉\",1,0)))","v":0},{"$f":"IF(ISNA(VLOOKUP($A86,'GPIO Configuration'!$B$4:$O$97,14,FALSE)),0,MATCH(VLOOKUP($A86,'GPIO Configuration'!$B$4:$O$97,14,FALSE),INDIRECT($A86&\"_Func\"),0)-1)","v":0},{"$f":"IF(ISNA(VLOOKUP($A86,'GPIO Configuration'!$B$4:$P$97,15,FALSE)),0,MATCH(VLOOKUP($A86,'GPIO Configuration'!$B$4:$P$97,15,FALSE),INDIRECT($A86&\"_OutDrv\"),0)-1)","v":0}]
["P2_20",2,20,"0x0054","GPIO_PODR2_POD20","GPIO_PIDR2_PID20",{"$f":"IF(ISNA(VLOOKUP($A87,'GPIO Configuration'!$B$4:$C$97,2,FALSE)),0,1)","v":1},{"$f":"IF(ISNA(VLOOKUP($A87,'GPIO Configuration'!$B$4:$C$97,2,FALSE)),0,IF(VLOOKUP($A87,'GPIO Configuration'!$B$4:$C$97,2,FALSE)=\"是\",1,0))","v":0},{"$f":"IF(ISNA(VLOOKUP($A87,'GPIO Configuration'!$B$4:$D$97,3,FALSE)),\"\",TRIM(VLOOKUP($A87,'GPIO Configuration'!$B$4:$D$97,3,FALSE)))","v":""},{"$f":"IF(ISNA(VLOOKUP($A87,'GPIO Configuration'!$B$4:$E$97,4,FALSE)),0,IF(VLOOKUP($A87,'GPIO Configuration'!$B$4:$E$97,4,FALSE)=\"OUT - 输出\",1,0))","v":1},{"$f":"IF(ISNA(VLOOKUP($A87,'GPIO Configuration'!$B$4:$F$97,5,FALSE)),0,IF(VLOOKUP($A87,'GPIO Configuration'!$B$4:$F$97,5,FALSE)=\"1 - 高电平\",1,0))","v":0},{"$f":"IF(ISNA(VLOOKUP($A87,'GPIO Configuration'!$B$4:$K$97,10,FALSE)),0,IF(VLOOKUP($A87,'GPIO Configuration'!$B$4:$K$97,10,FALSE)=\"1 - 使能\",1,0))","v":0},{"$f":"IF(ISNA(VLOOKUP($A87,'GPIO Configuration'!$B$4:$J$97,9,FALSE)),0,MATCH(VLOOKUP($A87,'GPIO Configuration'!$B$4:$J$97,9,FALSE),INDIRECT($A87&\"_InLv\"),0)-1)","v":0},{"$f":"IF(ISNA(VLOOKUP($A87,'GPIO Configuration'!$B$4:$L$97,11,FALSE)),0,IF(VLOOKUP($A87,'GPIO Configuration'!$B$4:$L$97,11,FALSE)=\"1 - 使能\",1,0))","v":1},{"$f":"IF(ISNA(VLOOKUP($A87,'GPIO Configuration'!$B$4:$I$97,8,FALSE)),0,IF(VLOOKUP($A87,'GPIO Configuration'!$B$4:$I$97,8,FALSE)=\"上拉\",2,IF(VLOOKUP($A87,'GPIO Configuration'!$B$4:$I$97,8,FALSE)=\"下拉\",1,0)))","v":0},{"$f":"IF(ISNA(VLOOKUP($A87,'GPIO Configuration'!$B$4:$G$97,6,FALSE)),0,MATCH(VLOOKUP($A87,'GPIO Configuration'!$B$4:$G$97,6,FALSE),INDIRECT($A87&\"_Func\"),0)-1)","v":0},{"$f":"IF(ISNA(VLOOKUP($A87,'GPIO Configuration'!$B$4:$H$97,7,FALSE)),0,MATCH(VLOOKUP($A87,'GPIO Configuration'!$B$4:$H$97,7,FALSE),INDIRECT($A87&\"_OutDrv\"),0)-1)","v":3},{"$f":"IF(ISNA(VLOOKUP($A87,'GPIO Configuration'!$B$4:$M$97,12,FALSE)),0,IF(VLOOKUP($A87,'GPIO Configuration'!$B$4:$M$97,12,FALSE)=\"OUT - 输出\",1,0))","v":1},{"$f":"IF(ISNA(VLOOKUP($A87,'GPIO Configuration'!$B$4:$N$97,13,FALSE)),0,IF(VLOOKUP($A87,'GPIO Configuration'!$B$4:$N$97,13,FALSE)=\"1 - 高电平\",1,0))","v":0},{"$f":"IF(ISNA(VLOOKUP($A87,'GPIO Configuration'!$B$4:$S$97,18,FALSE)),0,IF(VLOOKUP($A87,'GPIO Configuration'!$B$4:$S$97,18,FALSE)=\"1 - 使能\",1,0))","v":0},{"$f":"IF(ISNA(VLOOKUP($A87,'GPIO Configuration'!$B$4:$R$97,17,FALSE)),0,MATCH(VLOOKUP($A87,'GPIO Configuration'!$B$4:$R$97,17,FALSE),INDIRECT($A87&\"_InLv\"),0)-1)","v":0},{"$f":"IF(ISNA(VLOOKUP($A87,'GPIO Configuration'!$B$4:$T$97,19,FALSE)),0,IF(VLOOKUP($A87,'GPIO Configuration'!$B$4:$T$97,19,FALSE)=\"1 - 使能\",1,0))","v":1},{"$f":"IF(ISNA(VLOOKUP($A87,'GPIO Configuration'!$B$4:$Q$97,16,FALSE)),0,IF(VLOOKUP($A87,'GPIO Configuration'!$B$4:$Q$97,16,FALSE)=\"上拉\",2,IF(VLOOKUP($A87,'GPIO Configuration'!$B$4:$Q$97,16,FALSE)=\"下拉\",1,0)))","v":0},{"$f":"IF(ISNA(VLOOKUP($A87,'GPIO Configuration'!$B$4:$O$97,14,FALSE)),0,MATCH(VLOOKUP($A87,'GPIO Configuration'!$B$4:$O$97,14,FALSE),INDIRECT($A87&\"_Func\"),0)-1)","v":0},{"$f":"IF(ISNA(VLOOKUP($A87,'GPIO Configuration'!$B$4:$P$97,15,FALSE)),0,MATCH(VLOOKUP($A87,'GPIO Configuration'!$B$4:$P$97,15,FALSE),INDIRECT($A87&\"_OutDrv\"),0)-1)","v":0}]
["P2_21",2,21,"0x0055","GPIO_PODR2_POD21","GPIO_PIDR2_PID21",{"$f":"IF(ISNA(VLOOKUP($A88,'GPIO Configuration'!$B$4:$C$97,2,FALSE)),0,1)","v":1},{"$f":"IF(ISNA(VLOOKUP($A88,'GPIO Configuration'!$B$4:$C$97,2,FALSE)),0,IF(VLOOKUP($A88,'GPIO Configuration'!$B$4:$C$97,2,FALSE)=\"是\",1,0))","v":0},{"$f":"IF(ISNA(VLOOKUP($A88,'GPIO Configuration'!$B$4:$D$97,3,FALSE)),\"\",TRIM(VLOOKUP($A88,'GPIO Configuration'!$B$4:$D$97,3,FALSE)))","v":""},{"$f":"IF(ISNA(VLOOKUP($A88,'GPIO Configuration'!$B$4:$E$97,4,FALSE)),0,IF(VLOOKUP($A88,'GPIO Configuration'!$B$4:$E$97,4,FALSE)=\"OUT - 输出\",1,0))","v":1},{"$f":"IF(ISNA(VLOOKUP($A88,'GPIO Configuration'!$B$4:$F$97,5,FALSE)),0,IF(VLOOKUP($A88,'GPIO Configuration'!$B$4:$F$97,5,FALSE)=\"1 - 高电平\",1,0))","v":0},{"$f":"IF(ISNA(VLOOKUP($A88,'GPIO Configuration'!$B$4:$K$97,10,FALSE)),0,IF(VLOOKUP($A88,'GPIO Configuration'!$B$4:$K$97,10,FALSE)=\"1 - 使能\",1,0))","v":0},{"$f":"IF(ISNA(VLOOKUP($A88,'GPIO Configuration'!$B$4:$J$97,9,FALSE)),0,MATCH(VLOOKUP($A88,'GPIO Configuration'!$B$4:$J$97,9,FALSE),INDIRECT($A88&\"_InLv\"),0)-1)","v":0},{"$f":"IF(ISNA(VLOOKUP($A88,'GPIO Configuration'!$B$4:$L$97,11,FALSE)),0,IF(VLOOKUP($A88,'GPIO Configuration'!$B$4:$L$97,11,FALSE)=\"1 - 使能\",1,0))","v":1},{"$f":"IF(ISNA(VLOOKUP($A88,'GPIO Configuration'!$B$4:$I$97,8,FALSE)),0,IF(VLOOKUP($A88,'GPIO Configuration'!$B$4:$I$97,8,FALSE)=\"上拉\",2,IF(VLOOKUP($A88,'GPIO Configuration'!$B$4:$I$97,8,FALSE)=\"下拉\",1,0)))","v":0},{"$f":"IF(ISNA(VLOOKUP($A88,'GPIO Configuration'!$B$4:$G$97,6,FALSE)),0,MATCH(VLOOKUP($A88,'GPIO Configuration'!$B$4:$G$97,6,FALSE),INDIRECT($A88&\"_Func\"),0)-1)","v":0},{"$f":"IF(ISNA(VLOOKUP($A88,'GPIO Configuration'!$B$4:$H$97,7,FALSE)),0,MATCH(VLOOKUP($A88,'GPIO Configuration'!$B$4:$H$97,7,FALSE),INDIRECT($A88&\"_OutDrv\"),0)-1)","v":3},{"$f":"IF(ISNA(VLOOKUP($A88,'GPIO Configuration'!$B$4:$M$97,12,FALSE)),0,IF(VLOOKUP($A88,'GPIO Configuration'!$B$4:$M$97,12,FALSE)=\"OUT - 输出\",1,0))","v":1},{"$f":"IF(ISNA(VLOOKUP($A88,'GPIO Configuration'!$B$4:$N$97,13,FALSE)),0,IF(VLOOKUP($A88,'GPIO Configuration'!$B$4:$N$97,13,FALSE)=\"1 - 高电平\",1,0))","v":0},{"$f":"IF(ISNA(VLOOKUP($A88,'GPIO Configuration'!$B$4:$S$97,18,FALSE)),0,IF(VLOOKUP($A88,'GPIO Configuration'!$B$4:$S$97,18,FALSE)=\"1 - 使能\",1,0))","v":0},{"$f":"IF(ISNA(VLOOKUP($A88,'GPIO Configuration'!$B$4:$R$97,17,FALSE)),0,MATCH(VLOOKUP($A88,'GPIO Configuration'!$B$4:$R$97,17,FALSE),INDIRECT($A88&\"_InLv\"),0)-1)","v":0},{"$f":"IF(ISNA(VLOOKUP($A88,'GPIO Configuration'!$B$4:$T$97,19,FALSE)),0,IF(VLOOKUP($A88,'GPIO Configuration'!$B$4:$T$97,19,FALSE)=\"1 - 使能\",1,0))","v":1},{"$f":"IF(ISNA(VLOOKUP($A88,'GPIO Configuration'!$B$4:$Q$97,16,FALSE)),0,IF(VLOOKUP($A88,'GPIO Configuration'!$B$4:$Q$97,16,FALSE)=\"上拉\",2,IF(VLOOKUP($A88,'GPIO Configuration'!$B$4:$Q$97,16,FALSE)=\"下拉\",1,0)))","v":0},{"$f":"IF(ISNA(VLOOKUP($A88,'GPIO Configuration'!$B$4:$O$97,14,FALSE)),0,MATCH(VLOOKUP($A88,'GPIO Configuration'!$B$4:$O$97,14,FALSE),INDIRECT($A88&\"_Func\"),0)-1)","v":0},{"$f":"IF(ISNA(VLOOKUP($A88,'GPIO Configuration'!$B$4:$P$97,15,FALSE)),0,MATCH(VLOOKUP($A88,'GPIO Configuration'!$B$4:$P$97,15,FALSE),INDIRECT($A88&\"_OutDrv\"),0)-1)","v":0}]
["P2_22",2,22,"0x0056","GPIO_PODR2_POD22","GPIO_PIDR2_PID22",{"$f":"IF(ISNA(VLOOKUP($A89,'GPIO Configuration'!$B$4:$C$97,2,FALSE)),0,1)","v":1},{"$f":"IF(ISNA(VLOOKUP($A89,'GPIO Configuration'!$B$4:$C$97,2,FALSE)),0,IF(VLOOKUP($A89,'GPIO Configuration'!$B$4:$C$97,2,FALSE)=\"是\",1,0))","v":1},{"$f":"IF(ISNA(VLOOKUP($A89,'GPIO Configuration'!$B$4:$D$97,3,FALSE)),\"\",TRIM(VLOOKUP($A89,'GPIO Configuration'!$B$4:$D$97,3,FALSE)))","v":"RADA5V_EN"},{"$f":"IF(ISNA(VLOOKUP($A89,'GPIO Configuration'!$B$4:$E$97,4,FALSE)),0,IF(VLOOKUP($A89,'GPIO Configuration'!$B$4:$E$97,4,FALSE)=\"OUT - 输出\",1,0))","v":1},{"$f":"IF(ISNA(VLOOKUP($A89,'GPIO Configuration'!$B$4:$F$97,5,FALSE)),0,IF(VLOOKUP($A89,'GPIO Configuration'!$B$4:$F$97,5,FALSE)=\"1 - 高电平\",1,0))","v":1},{"$f":"IF(ISNA(VLOOKUP($A89,'GPIO Configuration'!$B$4:$K$97,10,FALSE)),0,IF(VLOOKUP($A89,'GPIO Configuration'!$B$4:$K$97,10,FALSE)=\"1 - 使能\",1,0))","v":0},{"$f":"IF(ISNA(VLOOKUP($A89,'GPIO Configuration'!$B$4:$J$97,9,FALSE)),0,MATCH(VLOOKUP($A89,'GPIO Configuration'!$B$4:$J$97,9,FALSE),INDIRECT($A89&\"_InLv\"),0)-1)","v":0},{"$f":"IF(ISNA(VLOOKUP($A89,'GPIO Configuration'!$B$4:$L$97,11,FALSE)),0,IF(VLOOKUP($A89,'GPIO Configuration'!$B$4:$L$97,11,FALSE)=\"1 - 使能\",1,0))","v":1},{"$f":"IF(ISNA(VLOOKUP($A89,'GPIO Configuration'!$B$4:$I$97,8,FALSE)),0,IF(VLOOKUP($A89,'GPIO Configuration'!$B$4:$I$97,8,FALSE)=\"上拉\",2,IF(VLOOKUP($A89,'GPIO Configuration'!$B$4:$I$97,8,FALSE)=\"下拉\",1,0)))","v":0},{"$f":"IF(ISNA(VLOOKUP($A89,'GPIO Configuration'!$B$4:$G$97,6,FALSE)),0,MATCH(VLOOKUP($A89,'GPIO Configuration'!$B$4:$G$97,6,FALSE),INDIRECT($A89&\"_Func\"),0)-1)","v":0},{"$f":"IF(ISNA(VLOOKUP($A89,'GPIO Configuration'!$B$4:$H$97,7,FALSE)),0,MATCH(VLOOKUP($A89,'GPIO Configuration'!$B$4:$H$97,7,FALSE),INDIRECT($A89&\"_OutDrv\"),0)-1)","v":3},{"$f":"IF(ISNA(VLOOKUP($A89,'GPIO Configuration'!$B$4:$M$97,12,FALSE)),0,IF(VLOOKUP($A89,'GPIO Configuration'!$B$4:$M$97,12,FALSE)=\"OUT - 输出\",1,0))","v":1},{"$f":"IF(ISNA(VLOOKUP($A89,'GPIO Configuration'!$B$4:$N$97,13,FALSE)),0,IF(VLOOKUP($A89,'GPIO Configuration'!$B$4:$N$97,13,FALSE)=\"1 - 高电平\",1,0))","v":1},{"$f":"IF(ISNA(VLOOKUP($A89,'GPIO Configuration'!$B$4:$S$97,18,FALSE)),0,IF(VLOOKUP($A89,'GPIO Configuration'!$B$4:$S$97,18,FALSE)=\"1 - 使能\",1,0))","v":0},{"$f":"IF(ISNA(VLOOKUP($A89,'GPIO Configuration'!$B$4:$R$97,17,FALSE)),0,MATCH(VLOOKUP($A89,'GPIO Configuration'!$B$4:$R$97,17,FALSE),INDIRECT($A89&\"_InLv\"),0)-1)","v":0},{"$f":"IF(ISNA(VLOOKUP($A89,'GPIO Configuration'!$B$4:$T$97,19,FALSE)),0,IF(VLOOKUP($A89,'GPIO Configuration'!$B$4:$T$97,19,FALSE)=\"1 - 使能\",1,0))","v":1},{"$f":"IF(ISNA(VLOOKUP($A89,'GPIO Configuration'!$B$4:$Q$97,16,FALSE)),0,IF(VLOOKUP($A89,'GPIO Configuration'!$B$4:$Q$97,16,FALSE)=\"上拉\",2,IF(VLOOKUP($A89,'GPIO Configuration'!$B$4:$Q$97,16,FALSE)=\"下拉\",1,0)))","v":0},{"$f":"IF(ISNA(VLOOKUP($A89,'GPIO Configuration'!$B$4:$O$97,14,FALSE)),0,MATCH(VLOOKUP($A89,'GPIO Configuration'!$B$4:$O$97,14,FALSE),INDIRECT($A89&\"_Func\"),0)-1)","v":0},{"$f":"IF(ISNA(VLOOKUP($A89,'GPIO Configuration'!$B$4:$P$97,15,FALSE)),0,MATCH(VLOOKUP($A89,'GPIO Configuration'!$B$4:$P$97,15,FALSE),INDIRECT($A89&\"_OutDrv\"),0)-1)","v":0}]
["P2_23",2,23,"0x0057","GPIO_PODR2_POD23","GPIO_PIDR2_PID23",{"$f":"IF(ISNA(VLOOKUP($A90,'GPIO Configuration'!$B$4:$C$97,2,FALSE)),0,1)","v":1},{"$f":"IF(ISNA(VLOOKUP($A90,'GPIO Configuration'!$B$4:$C$97,2,FALSE)),0,IF(VLOOKUP($A90,'GPIO Configuration'!$B$4:$C$97,2,FALSE)=\"是\",1,0))","v":1},{"$f":"IF(ISNA(VLOOKUP($A90,'GPIO Configuration'!$B$4:$D$97,3,FALSE)),\"\",TRIM(VLOOKUP($A90,'GPIO Configuration'!$B$4:$D$97,3,FALSE)))","v":"RADA_TX"},{"$f":"IF(ISNA(VLOOKUP($A90,'GPIO Configuration'!$B$4:$E$97,4,FALSE)),0,IF(VLOOKUP($A90,'GPIO Configuration'!$B$4:$E$97,4,FALSE)=\"OUT - 输出\",1,0))","v":1},{"$f":"IF(ISNA(VLOOKUP($A90,'GPIO Configuration'!$B$4:$F$97,5,FALSE)),0,IF(VLOOKUP($A90,'GPIO Configuration'!$B$4:$F$97,5,FALSE)=\"1 - 高电平\",1,0))","v":1},{"$f":"IF(ISNA(VLOOKUP($A90,'GPIO Configuration'!$B$4:$K$97,10,FALSE)),0,IF(VLOOKUP($A90,'GPIO Configuration'!$B$4:$K$97,10,FALSE)=\"1 - 使能\",1,0))","v":0},{"$f":"IF(ISNA(VLOOKUP($A90,'GPIO Configuration'!$B$4:$J$97,9,FALSE)),0,MATCH(VLOOKUP($A90,'GPIO Configuration'!$B$4:$J$97,9,FALSE),INDIRECT($A90&\"_InLv\"),0)-1)","v":0},{"$f":"IF(ISNA(VLOOKUP($A90,'GPIO Configuration'!$B$4:$L$97,11,FALSE)),0,IF(VLOOKUP($A90,'GPIO Configuration'!$B$4:$L$97,11,FALSE)=\"1 - 使能\",1,0))","v":0},{"$f":"IF(ISNA(VLOOKUP($A90,'GPIO Configuration'!$B$4:$I$97,8,FALSE)),0,IF(VLOOKUP($A90,'GPIO Configuration'!$B$4:$I$97,8,FALSE)=\"上拉\",2,IF(VLOOKUP($A90,'GPIO Configuration'!$B$4:$I$97,8,FALSE)=\"下拉\",1,0)))","v":0},{"$f":"IF(ISNA(VLOOKUP($A90,'GPIO Configuration'!$B$4:$G$97,6,FALSE)),0,MATCH(VLOOKUP($A90,'GPIO Configuration'!$B$4:$G$97,6,FALSE),INDIRECT($A90&\"_Func\"),0)-1)","v":1},{"$f":"IF(ISNA(VLOOKUP($A90,'GPIO Configuration'!$B$4:$H$97,7,FALSE)),0,MATCH(VLOOKUP($A90,'GPIO Configuration'!$B$4:$H$97,7,FALSE),INDIRECT($A90&\"_OutDrv\"),0)-1)","v":3},{"$f":"IF(ISNA(VLOOKUP($A90,'GPIO Configuration'!$B$4:$M$97,12,FALSE)),0,IF(VLOOKUP($A90,'GPIO Configuration'!$B$4:$M$97,12,FALSE)=\"OUT - 输出\",1,0))","v":1},{"$f":"IF(ISNA(VLOOKUP($A90,'GPIO Configuration'!$B$4:$N$97,13,FALSE)),0,IF(VLOOKUP($A90,'GPIO Configuration'!$B$4:$N$97,13,FALSE)=\"1 - 高电平\",1,0))","v":0},{"$f":"IF(ISNA(VLOOKUP($A90,'GPIO Configuration'!$B$4:$S$97,18,FALSE)),0,IF(VLOOKUP($A90,'GPIO Configuration'!$B$4:$S$97,18,FALSE)=\"1 - 使能\",1,0))","v":0},{"$f":"IF(ISNA(VLOOKUP($A90,'GPIO Configuration'!$B$4:$R$97,17,FALSE)),0,MATCH(VLOOKUP($A90,'GPIO Configuration'!$B$4:$R$97,17,FALSE),INDIRECT($A90&\"_InLv\"),0)-1)","v":0},{"$f":"IF(ISNA(VLOOKUP($A90,'GPIO Configuration'!$B$4:$T$97,19,FALSE)),0,IF(VLOOKUP($A90,'GPIO Configuration'!$B$4:$T$97,19,FALSE)=\"1 - 使能\",1,0))","v":1},{"$f":"IF(ISNA(VLOOKUP($A90,'GPIO Configuration'!$B$4:$Q$97,16,FALSE)),0,IF(VLOOKUP($A90,'GPIO Configuration'!$B$4:$Q$97,16,FALSE)=\"上拉\",2,IF(VLOOKUP($A90,'GPIO Configuration'!$B$4:$Q$97,16,FALSE)=\"下拉\",1,0)))","v":0},{"$f":"IF(ISNA(VLOOKUP($A90,'GPIO Configuration'!$B$4:$O$97,14,FALSE)),0,MATCH(VLOOKUP($A90,'GPIO Configuration'!$B$4:$O$97,14,FALSE),INDIRECT($A90&\"_Func\"),0)-1)","v":0},{"$f":"IF(ISNA(VLOOKUP($A90,'GPIO Configuration'!$B$4:$P$97,15,FALSE)),0,MATCH(VLOOKUP($A90,'GPIO Configuration'!$B$4:$P$97,15,FALSE),INDIRECT($A90&\"_OutDrv\"),0)-1)","v":0}]
["P2_24",2,24,"0x0058","GPIO_PODR2_POD24","GPIO_PIDR2_PID24",{"$f":"IF(ISNA(VLOOKUP($A91,'GPIO Configuration'!$B$4:$C$97,2,FALSE)),0,1)","v":1},{"$f":"IF(ISNA(VLOOKUP($A91,'GPIO Configuration'!$B$4:$C$97,2,FALSE)),0,IF(VLOOKUP($A91,'GPIO Configuration'!$B$4:$C$97,2,FALSE)=\"是\",1,0))","v":0},{"$f":"IF(ISNA(VLOOKUP($A91,'GPIO Configuration'!$B$4:$D$97,3,FALSE)),\"\",TRIM(VLOOKUP($A91,'GPIO Configuration'!$B$4:$D$97,3,FALSE)))","v":""},{"$f":"IF(ISNA(VLOOKUP($A91,'GPIO Configuration'!$B$4:$E$97,4,FALSE)),0,IF(VLOOKUP($A91,'GPIO Configuration'!$B$4:$E$97,4,FALSE)=\"OUT - 输出\",1,0))","v":0},{"$f":"IF(ISNA(VLOOKUP($A91,'GPIO Configuration'!$B$4:$F$97,5,FALSE)),0,IF(VLOOKUP($A91,'GPIO Configuration'!$B$4:$F$97,5,FALSE)=\"1 - 高电平\",1,0))","v":0},{"$f":"IF(ISNA(VLOOKUP($A91,'GPIO Configuration'!$B$4:$K$97,10,FALSE)),0,IF(VLOOKUP($A91,'GPIO Configuration'!$B$4:$K$97,10,FALSE)=\"1 - 使能\",1,0))","v":1},{"$f":"IF(ISNA(VLOOKUP($A91,'GPIO Configuration'!$B$4:$J$97,9,FALSE)),0,MATCH(VLOOKUP($A91,'GPIO Configuration'!$B$4:$J$97,9,FALSE),INDIRECT($A91&\"_InLv\"),0)-1)","v":0},{"$f":"IF(ISNA(VLOOKUP($A91,'GPIO Configuration'!$B$4:$L$97,11,FALSE)),0,IF(VLOOKUP($A91,'GPIO Configuration'!$B$4:$L$97,11,FALSE)=\"1 - 使能\",1,0))","v":1},{"$f":"IF(ISNA(VLOOKUP($A91,'GPIO Configuration'!$B$4:$I$97,8,FALSE)),0,IF(VLOOKUP($A91,'GPIO Configuration'!$B$4:$I$97,8,FALSE)=\"上拉\",2,IF(VLOOKUP($A91,'GPIO Configuration'!$B$4:$I$97,8,FALSE)=\"下拉\",1,0)))","v":0},{"$f":"IF(ISNA(VLOOKUP($A91,'GPIO Configuration'!$B$4:$G$97,6,FALSE)),0,MATCH(VLOOKUP($A91,'GPIO Configuration'!$B$4:$G$97,6,FALSE),INDIRECT($A91&\"_Func\"),0)-1)","v":0},{"$f":"IF(ISNA(VLOOKUP($A91,'GPIO Configuration'!$B$4:$H$97,7,FALSE)),0,MATCH(VLOOKUP($A91,'GPIO Configuration'!$B$4:$H$97,7,FALSE),INDIRECT($A91&\"_OutDrv\"),0)-1)","v":3},{"$f":"IF(ISNA(VLOOKUP($A91,'GPIO Configuration'!$B$4:$M$97,12,FALSE)),0,IF(VLOOKUP($A91,'GPIO Configuration'!$B$4:$M$97,12,FALSE)=\"OUT - 输出\",1,0))","v":0},{"$f":"IF(ISNA(VLOOKUP($A91,'GPIO Configuration'!$B$4:$N$97,13,FALSE)),0,IF(VLOOKUP($A91,'GPIO Configuration'!$B$4:$N$97,13,FALSE)=\"1 - 高电平\",1,0))","v":0},{"$f":"IF(ISNA(VLOOKUP($A91,'GPIO Configuration'!$B$4:$S$97,18,FALSE)),0,IF(VLOOKUP($A91,'GPIO Configuration'!$B$4:$S$97,18,FALSE)=\"1 - 使能\",1,0))","v":1},{"$f":"IF(ISNA(VLOOKUP($A91,'GPIO Configuration'!$B$4:$R$97,17,FALSE)),0,MATCH(VLOOKUP($A91,'GPIO Configuration'!$B$4:$R$97,17,FALSE),INDIRECT($A91&\"_InLv\"),0)-1)","v":0},{"$f":"IF(ISNA(VLOOKUP($A91,'GPIO Configuration'!$B$4:$T$97,19,FALSE)),0,IF(VLOOKUP($A91,'GPIO Configuration'!$B$4:$T$97,19,FALSE)=\"1 - 使能\",1,0))","v":1},{"$f":"IF(ISNA(VLOOKUP($A91,'GPIO Configuration'!$B$4:$Q$97,16,FALSE)),0,IF(VLOOKUP($A91,'GPIO Configuration'!$B$4:$Q$97,16,FALSE)=\"上拉\",2,IF(VLOOKUP($A91,'GPIO Configuration'!$B$4:$Q$97,16,FALSE)=\"下拉\",1,0)))","v":0},{"$f":"IF(ISNA(VLOOKUP($A91,'GPIO Configuration'!$B$4:$O$97,14,FALSE)),0,MATCH(VLOOKUP($A91,'GPIO Configuration'!$B$4:$O$97,14,FALSE),INDIRECT($A91&\"_Func\"),0)-1)","v":0},{"$f":"IF(ISNA(VLOOKUP($A91,'GPIO Configuration'!$B$4:$P$97,15,FALSE)),0,MATCH(VLOOKUP($A91,'GPIO Configuration'!$B$4:$P$97,15,FALSE),INDIRECT($A91&\"_OutDrv\"),0)-1)","v":0}]
["P2_25",2,25,"0x0059","GPIO_PODR2_POD25","GPIO_PIDR2_PID25",{"$f":"IF(ISNA(VLOOKUP($A92,'GPIO Configuration'!$B$4:$C$97,2,FALSE)),0,1)","v":1},{"$f":"IF(ISNA(VLOOKUP($A92,'GPIO Configuration'!$B$4:$C$97,2,FALSE)),0,IF(VLOOKUP($A92,'GPIO Configuration'!$B$4:$C$97,2,FALSE)=\"是\",1,0))","v":1},{"$f":"IF(ISNA(VLOOKUP($A92,'GPIO Configuration'!$B$4:$D$97,3,FALSE)),\"\",TRIM(VLOOKUP($A92,'GPIO Configuration'!$B$4:$D$97,3,FALSE)))","v":"RADA_RX"},{"$f":"IF(ISNA(VLOOKUP($A92,'GPIO Configuration'!$B$4:$E$97,4,FALSE)),0,IF(VLOOKUP($A92,'GPIO Configuration'!$B$4:$E$97,4,FALSE)=\"OUT - 输出\",1,0))","v":0},{"$f":"IF(ISNA(VLOOKUP($A92,'GPIO Configuration'!$B$4:$F$97,5,FALSE)),0,IF(VLOOKUP($A92,'GPIO Configuration'!$B$4:$F$97,5,FALSE)=\"1 - 高电平\",1,0))","v":1},{"$f":"IF(ISNA(VLOOKUP($A92,'GPIO Configuration'!$B$4:$K$97,10,FALSE)),0,IF(VLOOKUP($A92,'GPIO Configuration'!$B$4:$K$97,10,FALSE)=\"1 - 使能\",1,0))","v":1},{"$f":"IF(ISNA(VLOOKUP($A92,'GPIO Configuration'!$B$4:$J$97,9,FALSE)),0,MATCH(VLOOKUP($A92,'GPIO Configuration'!$B$4:$J$97,9,FALSE),INDIRECT($A92&\"_InLv\"),0)-1)","v":0},{"$f":"IF(ISNA(VLOOKUP($A92,'GPIO Configuration'!$B$4:$L$97,11,FALSE)),0,IF(VLOOKUP($A92,'GPIO Configuration'!$B$4:$L$97,11,FALSE)=\"1 - 使能\",1,0))","v":0},{"$f":"IF(ISNA(VLOOKUP($A92,'GPIO Configuration'!$B$4:$I$97,8,FALSE)),0,IF(VLOOKUP($A92,'GPIO Configuration'!$B$4:$I$97,8,FALSE)=\"上拉\",2,IF(VLOOKUP($A92,'GPIO Configuration'!$B$4:$I$97,8,FALSE)=\"下拉\",1,0)))","v":0},{"$f":"IF(ISNA(VLOOKUP($A92,'GPIO Configuration'!$B$4:$G$97,6,FALSE)),0,MATCH(VLOOKUP($A92,'GPIO Configuration'!$B$4:$G$97,6,FALSE),INDIRECT($A92&\"_Func\"),0)-1)","v":0},{"$f":"IF(ISNA(VLOOKUP($A92,'GPIO Configuration'!$B$4:$H$97,7,FALSE)),0,MATCH(VLOOKUP($A92,'GPIO Configuration'!$B$4:$H$97,7,FALSE),INDIRECT($A92&\"_OutDrv\"),0)-1)","v":3},{"$f":"IF(ISNA(VLOOKUP($A92,'GPIO Configuration'!$B$4:$M$97,12,FALSE)),0,IF(VLOOKUP($A92,'GPIO Configuration'!$B$4:$M$97,12,FALSE)=\"OUT - 输出\",1,0))","v":1},{"$f":"IF(ISNA(VLOOKUP($A92,'GPIO Configuration'!$B$4:$N$97,13,FALSE)),0,IF(VLOOKUP($A92,'GPIO Configuration'!$B$4:$N$97,13,FALSE)=\"1 - 高电平\",1,0))","v":0},{"$f":"IF(ISNA(VLOOKUP($A92,'GPIO Configuration'!$B$4:$S$97,18,FALSE)),0,IF(VLOOKUP($A92,'GPIO Configuration'!$B$4:$S$97,18,FALSE)=\"1 - 使能\",1,0))","v":0},{"$f":"IF(ISNA(VLOOKUP($A92,'GPIO Configuration'!$B$4:$R$97,17,FALSE)),0,MATCH(VLOOKUP($A92,'GPIO Configuration'!$B$4:$R$97,17,FALSE),INDIRECT($A92&\"_InLv\"),0)-1)","v":0},{"$f":"IF(ISNA(VLOOKUP($A92,'GPIO Configuration'!$B$4:$T$97,19,FALSE)),0,IF(VLOOKUP($A92,'GPIO Configuration'!$B$4:$T$97,19,FALSE)=\"1 - 使能\",1,0))","v":1},{"$f":"IF(ISNA(VLOOKUP($A92,'GPIO Configuration'!$B$4:$Q$97,16,FALSE)),0,IF(VLOOKUP($A92,'GPIO Configuration'!$B$4:$Q$97,16,FALSE)=\"上拉\",2,IF(VLOOKUP($A92,'GPIO Configuration'!$B$4:$Q$97,16,FALSE)=\"下拉\",1,0)))","v":0},{"$f":"IF(ISNA(VLOOKUP($A92,'GPIO Configuration'!$B$4:$O$97,14,FALSE)),0,MATCH(VLOOKUP($A92,'GPIO Configuration'!$B$4:$O$97,14,FALSE),INDIRECT($A92&\"_Func\"),0)-1)","v":0},{"$f":"IF(ISNA(VLOOKUP($A92,'GPIO Configuration'!$B$4:$P$97,15,FALSE)),0,MATCH(VLOOKUP($A92,'GPIO Configuration'!$B$4:$P$97,15,FALSE),INDIRECT($A92&\"_OutDrv\"),0)-1)","v":0}]
["P2_26",2,26,"0x005A","GPIO_PODR2_POD26","GPIO_PIDR2_PID26",{"$f":"IF(ISNA(VLOOKUP($A93,'GPIO Configuration'!$B$4:$C$97,2,FALSE)),0,1)","v":1},{"$f":"IF(ISNA(VLOOKUP($A93,'GPIO Configuration'!$B$4:$C$97,2,FALSE)),0,IF(VLOOKUP($A93,'GPIO Configuration'!$B$4:$C$97,2,FALSE)=\"是\",1,0))","v":0},{"$f":"IF(ISNA(VLOOKUP($A93,'GPIO Configuration'!$B$4:$D$97,3,FALSE)),\"\",TRIM(VLOOKUP($A93,'GPIO Configuration'!$B$4:$D$97,3,FALSE)))","v":""},{"$f":"IF(ISNA(VLOOKUP($A93,'GPIO Configuration'!$B$4:$E$97,4,FALSE)),0,IF(VLOOKUP($A93,'GPIO Configuration'!$B$4:$E$97,4,FALSE)=\"OUT - 输出\",1,0))","v":0},{"$f":"IF(ISNA(VLOOKUP($A93,'GPIO Configuration'!$B$4:$F$97,5,FALSE)),0,IF(VLOOKUP($A93,'GPIO Configuration'!$B$4:$F$97,5,FALSE)=\"1 - 高电平\",1,0))","v":0},{"$f":"IF(ISNA(VLOOKUP($A93,'GPIO Configuration'!$B$4:$K$97,10,FALSE)),0,IF(VLOOKUP($A93,'GPIO Configuration'!$B$4:$K$97,10,FALSE)=\"1 - 使能\",1,0))","v":1},{"$f":"IF(ISNA(VLOOKUP($A93,'GPIO Configuration'!$B$4:$J$97,9,FALSE)),0,MATCH(VLOOKUP($A93,'GPIO Configuration'!$B$4:$J$97,9,FALSE),INDIRECT($A93&\"_InLv\"),0)-1)","v":0},{"$f":"IF(ISNA(VLOOKUP($A93,'GPIO Configuration'!$B$4:$L$97,11,FALSE)),0,IF(VLOOKUP($A93,'GPIO Configuration'!$B$4:$L$97,11,FALSE)=\"1 - 使能\",1,0))","v":1},{"$f":"IF(ISNA(VLOOKUP($A93,'GPIO Configuration'!$B$4:$I$97,8,FALSE)),0,IF(VLOOKUP($A93,'GPIO Configuration'!$B$4:$I$97,8,FALSE)=\"上拉\",2,IF(VLOOKUP($A93,'GPIO Configuration'!$B$4:$I$97,8,FALSE)=\"下拉\",1,0)))","v":0},{"$f":"IF(ISNA(VLOOKUP($A93,'GPIO Configuration'!$B$4:$G$97,6,FALSE)),0,MATCH(VLOOKUP($A93,'GPIO Configuration'!$B$4:$G$97,6,FALSE),INDIRECT($A93&\"_Func\"),0)-1)","v":0},{"$f":"IF(ISNA(VLOOKUP($A93,'GPIO Configuration'!$B$4:$H$97,7,FALSE)),0,MATCH(VLOOKUP($A93,'GPIO Configuration'!$B$4:$H$97,7,FALSE),INDIRECT($A93&\"_OutDrv\"),0)-1)","v":3},{"$f":"IF(ISNA(VLOOKUP($A93,'GPIO Configuration'!$B$4:$M$97,12,FALSE)),0,IF(VLOOKUP($A93,'GPIO Configuration'!$B$4:$M$97,12,FALSE)=\"OUT - 输出\",1,0))","v":0},{"$f":"IF(ISNA(VLOOKUP($A93,'GPIO Configuration'!$B$4:$N$97,13,FALSE)),0,IF(VLOOKUP($A93,'GPIO Configuration'!$B$4:$N$97,13,FALSE)=\"1 - 高电平\",1,0))","v":0},{"$f":"IF(ISNA(VLOOKUP($A93,'GPIO Configuration'!$B$4:$S$97,18,FALSE)),0,IF(VLOOKUP($A93,'GPIO Configuration'!$B$4:$S$97,18,FALSE)=\"1 - 使能\",1,0))","v":0},{"$f":"IF(ISNA(VLOOKUP($A93,'GPIO Configuration'!$B$4:$R$97,17,FALSE)),0,MATCH(VLOOKUP($A93,'GPIO Configuration'!$B$4:$R$97,17,FALSE),INDIRECT($A93&\"_InLv\"),0)-1)","v":0},{"$f":"IF(ISNA(VLOOKUP($A93,'GPIO Configuration'!$B$4:$T$97,19,FALSE)),0,IF(VLOOKUP($A93,'GPIO Configuration'!$B$4:$T$97,19,FALSE)=\"1 - 使能\",1,0))","v":1},{"$f":"IF(ISNA(VLOOKUP($A93,'GPIO Configuration'!$B$4:$Q$97,16,FALSE)),0,IF(VLOOKUP($A93,'GPIO Configuration'!$B$4:$Q$97,16,FALSE)=\"上拉\",2,IF(VLOOKUP($A93,'GPIO Configuration'!$B$4:$Q$97,16,FALSE)=\"下拉\",1,0)))","v":0},{"$f":"IF(ISNA(VLOOKUP($A93,'GPIO Configuration'!$B$4:$O$97,14,FALSE)),0,MATCH(VLOOKUP($A93,'GPIO Configuration'!$B$4:$O$97,14,FALSE),INDIRECT($A93&\"_Func\"),0)-1)","v":0},{"$f":"IF(ISNA(VLOOKUP($A93,'GPIO Configuration'!$B$4:$P$97,15,FALSE)),0,MATCH(VLOOKUP($A93,'GPIO Configuration'!$B$4:$P$97,15,FALSE),INDIRECT($A93&\"_OutDrv\"),0)-1)","v":0}]
["P2_27",2,27,"0x005B","GPIO_PODR2_POD27","GPIO_PIDR2_PID27",{"$f":"IF(ISNA(VLOOKUP($A94,'GPIO Configuration'!$B$4:$C$97,2,FALSE)),0,1)","v":1},{"$f":"IF(ISNA(VLOOKUP($A94,'GPIO Configuration'!$B$4:$C$97,2,FALSE)),0,IF(VLOOKUP($A94,'GPIO Configuration'!$B$4:$C$97,2,FALSE)=\"是\",1,0))","v":0},{"$f":"IF(ISNA(VLOOKUP($A94,'GPIO Configuration'!$B$4:$D$97,3,FALSE)),\"\",TRIM(VLOOKUP($A94,'GPIO Configuration'!$B$4:$D$97,3,FALSE)))","v":""},{"$f":"IF(ISNA(VLOOKUP($A94,'GPIO Configuration'!$B$4:$E$97,4,FALSE)),0,IF(VLOOKUP($A94,'GPIO Configuration'!$B$4:$E$97,4,FALSE)=\"OUT - 输出\",1,0))","v":1},{"$f":"IF(ISNA(VLOOKUP($A94,'GPIO Configuration'!$B$4:$F$97,5,FALSE)),0,IF(VLOOKUP($A94,'GPIO Configuration'!$B$4:$F$97,5,FALSE)=\"1 - 高电平\",1,0))","v":1},{"$f":"IF(ISNA(VLOOKUP($A94,'GPIO Configuration'!$B$4:$K$97,10,FALSE)),0,IF(VLOOKUP($A94,'GPIO Configuration'!$B$4:$K$97,10,FALSE)=\"1 - 使能\",1,0))","v":0},{"$f":"IF(ISNA(VLOOKUP($A94,'GPIO Configuration'!$B$4:$J$97,9,FALSE)),0,MATCH(VLOOKUP($A94,'GPIO Configuration'!$B$4:$J$97,9,FALSE),INDIRECT($A94&\"_InLv\"),0)-1)","v":0},{"$f":"IF(ISNA(VLOOKUP($A94,'GPIO Configuration'!$B$4:$L$97,11,FALSE)),0,IF(VLOOKUP($A94,'GPIO Configuration'!$B$4:$L$97,11,FALSE)=\"1 - 使能\",1,0))","v":1},{"$f":"IF(ISNA(VLOOKUP($A94,'GPIO Configuration'!$B$4:$I$97,8,FALSE)),0,IF(VLOOKUP($A94,'GPIO Configuration'!$B$4:$I$97,8,FALSE)=\"上拉\",2,IF(VLOOKUP($A94,'GPIO Configuration'!$B$4:$I$97,8,FALSE)=\"下拉\",1,0)))","v":0},{"$f":"IF(ISNA(VLOOKUP($A94,'GPIO Configuration'!$B$4:$G$97,6,FALSE)),0,MATCH(VLOOKUP($A94,'GPIO Configuration'!$B$4:$G$97,6,FALSE),INDIRECT($A94&\"_Func\"),0)-1)","v":0},{"$f":"IF(ISNA(VLOOKUP($A94,'GPIO Configuration'!$B$4:$H$97,7,FALSE)),0,MATCH(VLOOKUP($A94,'GPIO Configuration'!$B$4:$H$97,7,FALSE),INDIRECT($A94&\"_OutDrv\"),0)-1)","v":3},{"$f":"IF(ISNA(VLOOKUP($A94,'GPIO Configuration'!$B$4:$M$97,12,FALSE)),0,IF(VLOOKUP($A94,'GPIO Configuration'!$B$4:$M$97,12,FALSE)=\"OUT - 输出\",1,0))","v":1},{"$f":"IF(ISNA(VLOOKUP($A94,'GPIO Configuration'!$B$4:$N$97,13,FALSE)),0,IF(VLOOKUP($A94,'GPIO Configuration'!$B$4:$N$97,13,FALSE)=\"1 - 高电平\",1,0))","v":0},{"$f":"IF(ISNA(VLOOKUP($A94,'GPIO Configuration'!$B$4:$S$97,18,FALSE)),0,IF(VLOOKUP($A94,'GPIO Configuration'!$B$4:$S$97,18,FALSE)=\"1 - 使能\",1,0))","v":0},{"$f":"IF(ISNA(VLOOKUP($A94,'GPIO Configuration'!$B$4:$R$97,17,FALSE)),0,MATCH(VLOOKUP($A94,'GPIO Configuration'!$B$4:$R$97,17,FALSE),INDIRECT($A94&\"_InLv\"),0)-1)","v":0},{"$f":"IF(ISNA(VLOOKUP($A94,'GPIO Configuration'!$B$4:$T$97,19,FALSE)),0,IF(VLOOKUP($A94,'GPIO Configuration'!$B$4:$T$97,19,FALSE)=\"1 - 使能\",1,0))","v":1},{"$f":"IF(ISNA(VLOOKUP($A94,'GPIO Configuration'!$B$4:$Q$97,16,FALSE)),0,IF(VLOOKUP($A94,'GPIO Configuration'!$B$4:$Q$97,16,FALSE)=\"上拉\",2,IF(VLOOKUP($A94,'GPIO Configuration'!$B$4:$Q$97,16,FALSE)=\"下拉\",1,0)))","v":0},{"$f":"IF(ISNA(VLOOKUP($A94,'GPIO Configuration'!$B$4:$O$97,14,FALSE)),0,MATCH(VLOOKUP($A94,'GPIO Configuration'!$B$4:$O$97,14,FALSE),INDIRECT($A94&\"_Func\"),0)-1)","v":0},{"$f":"IF(ISNA(VLOOKUP($A94,'GPIO Configuration'!$B$4:$P$97,15,FALSE)),0,MATCH(VLOOKUP($A94,'GPIO Configuration'!$B$4:$P$97,15,FALSE),INDIRECT($A94&\"_OutDrv\"),0)-1)","v":0}]
["P2_28",2,28,"0x005C","GPIO_PODR2_POD28","GPIO_PIDR2_PID28",{"$f":"IF(ISNA(VLOOKUP($A95,'GPIO Configuration'!$B$4:$C$97,2,FALSE)),0,1)","v":1},{"$f":"IF(ISNA(VLOOKUP($A95,'GPIO Configuration'!$B$4:$C$97,2,FALSE)),0,IF(VLOOKUP($A95,'GPIO Configuration'!$B$4:$C$97,2,FALSE)=\"是\",1,0))","v":0},{"$f":"IF(ISNA(VLOOKUP($A95,'GPIO Configuration'!$B$4:$D$97,3,FALSE)),\"\",TRIM(VLOOKUP($A95,'GPIO Configuration'!$B$4:$D$97,3,FALSE)))","v":""},{"$f":"IF(ISNA(VLOOKUP($A95,'GPIO Configuration'!$B$4:$E$97,4,FALSE)),0,IF(VLOOKUP($A95,'GPIO Configuration'!$B$4:$E$97,4,FALSE)=\"OUT - 输出\",1,0))","v":1},{"$f":"IF(ISNA(VLOOKUP($A95,'GPIO Configuration'!$B$4:$F$97,5,FALSE)),0,IF(VLOOKUP($A95,'GPIO Configuration'!$B$4:$F$97,5,FALSE)=\"1 - 高电平\",1,0))","v":0},{"$f":"IF(ISNA(VLOOKUP($A95,'GPIO Configuration'!$B$4:$K$97,10,FALSE)),0,IF(VLOOKUP($A95,'GPIO Configuration'!$B$4:$K$97,10,FALSE)=\"1 - 使能\",1,0))","v":0},{"$f":"IF(ISNA(VLOOKUP($A95,'GPIO Configuration'!$B$4:$J$97,9,FALSE)),0,MATCH(VLOOKUP($A95,'GPIO Configuration'!$B$4:$J$97,9,FALSE),INDIRECT($A95&\"_InLv\"),0)-1)","v":0},{"$f":"IF(ISNA(VLOOKUP($A95,'GPIO Configuration'!$B$4:$L$97,11,FALSE)),0,IF(VLOOKUP($A95,'GPIO Configuration'!$B$4:$L$97,11,FALSE)=\"1 - 使能\",1,0))","v":1},{"$f":"IF(ISNA(VLOOKUP($A95,'GPIO Configuration'!$B$4:$I$97,8,FALSE)),0,IF(VLOOKUP($A95,'GPIO Configuration'!$B$4:$I$97,8,FALSE)=\"上拉\",2,IF(VLOOKUP($A95,'GPIO Configuration'!$B$4:$I$97,8,FALSE)=\"下拉\",1,0)))","v":0},{"$f":"IF(ISNA(VLOOKUP($A95,'GPIO Configuration'!$B$4:$G$97,6,FALSE)),0,MATCH(VLOOKUP($A95,'GPIO Configuration'!$B$4:$G$97,6,FALSE),INDIRECT($A95&\"_Func\"),0)-1)","v":0},{"$f":"IF(ISNA(VLOOKUP($A95,'GPIO Configuration'!$B$4:$H$97,7,FALSE)),0,MATCH(VLOOKUP($A95,'GPIO Configuration'!$B$4:$H$97,7,FALSE),INDIRECT($A95&\"_OutDrv\"),0)-1)","v":3},{"$f":"IF(ISNA(VLOOKUP($A95,'GPIO Configuration'!$B$4:$M$97,12,FALSE)),0,IF(VLOOKUP($A95,'GPIO Configuration'!$B$4:$M$97,12,FALSE)=\"OUT - 输出\",1,0))","v":1},{"$f":"IF(ISNA(VLOOKUP($A95,'GPIO Configuration'!$B$4:$N$97,13,FALSE)),0,IF(VLOOKUP($A95,'GPIO Configuration'!$B$4:$N$97,13,FALSE)=\"1 - 高电平\",1,0))","v":0},{"$f":"IF(ISNA(VLOOKUP($A95,'GPIO Configuration'!$B$4:$S$97,18,FALSE)),0,IF(VLOOKUP($A95,'GPIO Configuration'!$B$4:$S$97,18,FALSE)=\"1 - 使能\",1,0))","v":0},{"$f":"IF(ISNA(VLOOKUP($A95,'GPIO Configuration'!$B$4:$R$97,17,FALSE)),0,MATCH(VLOOKUP($A95,'GPIO Configuration'!$B$4:$R$97,17,FALSE),INDIRECT($A95&\"_InLv\"),0)-1)","v":0},{"$f":"IF(ISNA(VLOOKUP($A95,'GPIO Configuration'!$B$4:$T$97,19,FALSE)),0,IF(VLOOKUP($A95,'GPIO Configuration'!$B$4:$T$97,19,FALSE)=\"1 - 使能\",1,0))","v":1},{"$f":"IF(ISNA(VLOOKUP($A95,'GPIO Configuration'!$B$4:$Q$97,16,FALSE)),0,IF(VLOOKUP($A95,'GPIO Configuration'!$B$4:$Q$97,16,FALSE)=\"上拉\",2,IF(VLOOKUP($A95,'GPIO Configuration'!$B$4:$Q$97,16,FALSE)=\"下拉\",1,0)))","v":0},{"$f":"IF(ISNA(VLOOKUP($A95,'GPIO Configuration'!$B$4:$O$97,14,FALSE)),0,MATCH(VLOOKUP($A95,'GPIO Configuration'!$B$4:$O$97,14,FALSE),INDIRECT($A95&\"_Func\"),0)-1)","v":0},{"$f":"IF(ISNA(VLOOKUP($A95,'GPIO Configuration'!$B$4:$P$97,15,FALSE)),0,MATCH(VLOOKUP($A95,'GPIO Configuration'!$B$4:$P$97,15,FALSE),INDIRECT($A95&\"_OutDrv\"),0)-1)","v":0}]
["P2_29",2,29,"0x005D","GPIO_PODR2_POD29","GPIO_PIDR2_PID29",{"$f":"IF(ISNA(VLOOKUP($A96,'GPIO Configuration'!$B$4:$C$97,2,FALSE)),0,1)","v":1},{"$f":"IF(ISNA(VLOOKUP($A96,'GPIO Configuration'!$B$4:$C$97,2,FALSE)),0,IF(VLOOKUP($A96,'GPIO Configuration'!$B$4:$C$97,2,FALSE)=\"是\",1,0))","v":0},{"$f":"IF(ISNA(VLOOKUP($A96,'GPIO Configuration'!$B$4:$D$97,3,FALSE)),\"\",TRIM(VLOOKUP($A96,'GPIO Configuration'!$B$4:$D$97,3,FALSE)))","v":""},{"$f":"IF(ISNA(VLOOKUP($A96,'GPIO Configuration'!$B$4:$E$97,4,FALSE)),0,IF(VLOOKUP($A96,'GPIO Configuration'!$B$4:$E$97,4,FALSE)=\"OUT - 输出\",1,0))","v":0},{"$f":"IF(ISNA(VLOOKUP($A96,'GPIO Configuration'!$B$4:$F$97,5,FALSE)),0,IF(VLOOKUP($A96,'GPIO Configuration'!$B$4:$F$97,5,FALSE)=\"1 - 高电平\",1,0))","v":0},{"$f":"IF(ISNA(VLOOKUP($A96,'GPIO Configuration'!$B$4:$K$97,10,FALSE)),0,IF(VLOOKUP($A96,'GPIO Configuration'!$B$4:$K$97,10,FALSE)=\"1 - 使能\",1,0))","v":1},{"$f":"IF(ISNA(VLOOKUP($A96,'GPIO Configuration'!$B$4:$J$97,9,FALSE)),0,MATCH(VLOOKUP($A96,'GPIO Configuration'!$B$4:$J$97,9,FALSE),INDIRECT($A96&\"_InLv\"),0)-1)","v":0},{"$f":"IF(ISNA(VLOOKUP($A96,'GPIO Configuration'!$B$4:$L$97,11,FALSE)),0,IF(VLOOKUP($A96,'GPIO Configuration'!$B$4:$L$97,11,FALSE)=\"1 - 使能\",1,0))","v":0},{"$f":"IF(ISNA(VLOOKUP($A96,'GPIO Configuration'!$B$4:$I$97,8,FALSE)),0,IF(VLOOKUP($A96,'GPIO Configuration'!$B$4:$I$97,8,FALSE)=\"上拉\",2,IF(VLOOKUP($A96,'GPIO Configuration'!$B$4:$I$97,8,FALSE)=\"下拉\",1,0)))","v":0},{"$f":"IF(ISNA(VLOOKUP($A96,'GPIO Configuration'!$B$4:$G$97,6,FALSE)),0,MATCH(VLOOKUP($A96,'GPIO Configuration'!$B$4:$G$97,6,FALSE),INDIRECT($A96&\"_Func\"),0)-1)","v":0},{"$f":"IF(ISNA(VLOOKUP($A96,'GPIO Configuration'!$B$4:$H$97,7,FALSE)),0,MATCH(VLOOKUP($A96,'GPIO Configuration'!$B$4:$H$97,7,FALSE),INDIRECT($A96&\"_OutDrv\"),0)-1)","v":3},{"$f":"IF(ISNA(VLOOKUP($A96,'GPIO Configuration'!$B$4:$M$97,12,FALSE)),0,IF(VLOOKUP($A96,'GPIO Configuration'!$B$4:$M$97,12,FALSE)=\"OUT - 输出\",1,0))","v":1},{"$f":"IF(ISNA(VLOOKUP($A96,'GPIO Configuration'!$B$4:$N$97,13,FALSE)),0,IF(VLOOKUP($A96,'GPIO Configuration'!$B$4:$N$97,13,FALSE)=\"1 - 高电平\",1,0))","v":0},{"$f":"IF(ISNA(VLOOKUP($A96,'GPIO Configuration'!$B$4:$S$97,18,FALSE)),0,IF(VLOOKUP($A96,'GPIO Configuration'!$B$4:$S$97,18,FALSE)=\"1 - 使能\",1,0))","v":0},{"$f":"IF(ISNA(VLOOKUP($A96,'GPIO Configuration'!$B$4:$R$97,17,FALSE)),0,MATCH(VLOOKUP($A96,'GPIO Configuration'!$B$4:$R$97,17,FALSE),INDIRECT($A96&\"_InLv\"),0)-1)","v":0},{"$f":"IF(ISNA(VLOOKUP($A96,'GPIO Configuration'!$B$4:$T$97,19,FALSE)),0,IF(VLOOKUP($A96,'GPIO Configuration'!$B$4:$T$97,19,FALSE)=\"1 - 使能\",1,0))","v":1},{"$f":"IF(ISNA(VLOOKUP($A96,'GPIO Configuration'!$B$4:$Q$97,16,FALSE)),0,IF(VLOOKUP($A96,'GPIO Configuration'!$B$4:$Q$97,16,FALSE)=\"上拉\",2,IF(VLOOKUP($A96,'GPIO Configuration'!$B$4:$Q$97,16,FALSE)=\"下拉\",1,0)))","v":0},{"$f":"IF(ISNA(VLOOKUP($A96,'GPIO Configuration'!$B$4:$O$97,14,FALSE)),0,MATCH(VLOOKUP($A96,'GPIO Configuration'!$B$4:$O$97,14,FALSE),INDIRECT($A96&\"_Func\"),0)-1)","v":0},{"$f":"IF(ISNA(VLOOKUP($A96,'GPIO Configuration'!$B$4:$P$97,15,FALSE)),0,MATCH(VLOOKUP($A96,'GPIO Configuration'!$B$4:$P$97,15,FALSE),INDIRECT($A96&\"_OutDrv\"),0)-1)","v":0}]
["P3_00",3,0,"0x0060","GPIO_PODR3_POD0","GPIO_PIDR3_PID0",{"$f":"IF(ISNA(VLOOKUP($A97,'GPIO Configuration'!$B$4:$C$97,2,FALSE)),0,1)","v":0},{"$f":"IF(ISNA(VLOOKUP($A97,'GPIO Configuration'!$B$4:$C$97,2,FALSE)),0,IF(VLOOKUP($A97,'GPIO Configuration'!$B$4:$C$97,2,FALSE)=\"是\",1,0))","v":0},{"$f":"IF(ISNA(VLOOKUP($A97,'GPIO Configuration'!$B$4:$D$97,3,FALSE)),\"\",TRIM(VLOOKUP($A97,'GPIO Configuration'!$B$4:$D$97,3,FALSE)))","v":""},{"$f":"IF(ISNA(VLOOKUP($A97,'GPIO Configuration'!$B$4:$E$97,4,FALSE)),0,IF(VLOOKUP($A97,'GPIO Configuration'!$B$4:$E$97,4,FALSE)=\"OUT - 输出\",1,0))","v":0},{"$f":"IF(ISNA(VLOOKUP($A97,'GPIO Configuration'!$B$4:$F$97,5,FALSE)),0,IF(VLOOKUP($A97,'GPIO Configuration'!$B$4:$F$97,5,FALSE)=\"1 - 高电平\",1,0))","v":0},{"$f":"IF(ISNA(VLOOKUP($A97,'GPIO Configuration'!$B$4:$K$97,10,FALSE)),0,IF(VLOOKUP($A97,'GPIO Configuration'!$B$4:$K$97,10,FALSE)=\"1 - 使能\",1,0))","v":0},{"$f":"IF(ISNA(VLOOKUP($A97,'GPIO Configuration'!$B$4:$J$97,9,FALSE)),0,MATCH(VLOOKUP($A97,'GPIO Configuration'!$B$4:$J$97,9,FALSE),INDIRECT($A97&\"_InLv\"),0)-1)","v":0},{"$f":"IF(ISNA(VLOOKUP($A97,'GPIO Configuration'!$B$4:$L$97,11,FALSE)),0,IF(VLOOKUP($A97,'GPIO Configuration'!$B$4:$L$97,11,FALSE)=\"1 - 使能\",1,0))","v":0},{"$f":"IF(ISNA(VLOOKUP($A97,'GPIO Configuration'!$B$4:$I$97,8,FALSE)),0,IF(VLOOKUP($A97,'GPIO Configuration'!$B$4:$I$97,8,FALSE)=\"上拉\",2,IF(VLOOKUP($A97,'GPIO Configuration'!$B$4:$I$97,8,FALSE)=\"下拉\",1,0)))","v":0},{"$f":"IF(ISNA(VLOOKUP($A97,'GPIO Configuration'!$B$4:$G$97,6,FALSE)),0,MATCH(VLOOKUP($A97,'GPIO Configuration'!$B$4:$G$97,6,FALSE),INDIRECT($A97&\"_Func\"),0)-1)","v":0},{"$f":"IF(ISNA(VLOOKUP($A97,'GPIO Configuration'!$B$4:$H$97,7,FALSE)),0,MATCH(VLOOKUP($A97,'GPIO Configuration'!$B$4:$H$97,7,FALSE),INDIRECT($A97&\"_OutDrv\"),0)-1)","v":0},{"$f":"IF(ISNA(VLOOKUP($A97,'GPIO Configuration'!$B$4:$M$97,12,FALSE)),0,IF(VLOOKUP($A97,'GPIO Configuration'!$B$4:$M$97,12,FALSE)=\"OUT - 输出\",1,0))","v":0},{"$f":"IF(ISNA(VLOOKUP($A97,'GPIO Configuration'!$B$4:$N$97,13,FALSE)),0,IF(VLOOKUP($A97,'GPIO Configuration'!$B$4:$N$97,13,FALSE)=\"1 - 高电平\",1,0))","v":0},{"$f":"IF(ISNA(VLOOKUP($A97,'GPIO Configuration'!$B$4:$S$97,18,FALSE)),0,IF(VLOOKUP($A97,'GPIO Configuration'!$B$4:$S$97,18,FALSE)=\"1 - 使能\",1,0))","v":0},{"$f":"IF(ISNA(VLOOKUP($A97,'GPIO Configuration'!$B$4:$R$97,17,FALSE)),0,MATCH(VLOOKUP($A97,'GPIO Configuration'!$B$4:$R$97,17,FALSE),INDIRECT($A97&\"_InLv\"),0)-1)","v":0},{"$f":"IF(ISNA(VLOOKUP($A97,'GPIO Configuration'!$B$4:$T$97,19,FALSE)),0,IF(VLOOKUP($A97,'GPIO Configuration'!$B$4:$T$97,19,FALSE)=\"1 - 使能\",1,0))","v":0},{"$f":"IF(ISNA(VLOOKUP($A97,'GPIO Configuration'!$B$4:$Q$97,16,FALSE)),0,IF(VLOOKUP($A97,'GPIO Configuration'!$B$4:$Q$97,16,FALSE)=\"上拉\",2,IF(VLOOKUP($A97,'GPIO Configuration'!$B$4:$Q$97,16,FALSE)=\"下拉\",1,0)))","v":0},{"$f":"IF(ISNA(VLOOKUP($A97,'GPIO Configuration'!$B$4:$O$97,14,FALSE)),0,MATCH(VLOOKUP($A97,'GPIO Configuration'!$B$4:$O$97,14,FALSE),INDIRECT($A97&\"_Func\"),0)-1)","v":0},{"$f":"IF(ISNA(VLOOKUP($A97,'GPIO Configuration'!$B$4:$P$97,15,FALSE)),0,MATCH(VLOOKUP($A97,'GPIO Configuration'!$B$4:$P$97,15,FALSE),INDIRECT($A97&\"_OutDrv\"),0)-1)","v":0}]
["P3_01",3,1,"0x0061","GPIO_PODR3_POD1","GPIO_PIDR3_PID1",{"$f":"IF(ISNA(VLOOKUP($A98,'GPIO Configuration'!$B$4:$C$97,2,FALSE)),0,1)","v":0},{"$f":"IF(ISNA(VLOOKUP($A98,'GPIO Configuration'!$B$4:$C$97,2,FALSE)),0,IF(VLOOKUP($A98,'GPIO Configuration'!$B$4:$C$97,2,FALSE)=\"是\",1,0))","v":0},{"$f":"IF(ISNA(VLOOKUP($A98,'GPIO Configuration'!$B$4:$D$97,3,FALSE)),\"\",TRIM(VLOOKUP($A98,'GPIO Configuration'!$B$4:$D$97,3,FALSE)))","v":""},{"$f":"IF(ISNA(VLOOKUP($A98,'GPIO Configuration'!$B$4:$E$97,4,FALSE)),0,IF(VLOOKUP($A98,'GPIO Configuration'!$B$4:$E$97,4,FALSE)=\"OUT - 输出\",1,0))","v":0},{"$f":"IF(ISNA(VLOOKUP($A98,'GPIO Configuration'!$B$4:$F$97,5,FALSE)),0,IF(VLOOKUP($A98,'GPIO Configuration'!$B$4:$F$97,5,FALSE)=\"1 - 高电平\",1,0))","v":0},{"$f":"IF(ISNA(VLOOKUP($A98,'GPIO Configuration'!$B$4:$K$97,10,FALSE)),0,IF(VLOOKUP($A98,'GPIO Configuration'!$B$4:$K$97,10,FALSE)=\"1 - 使能\",1,0))","v":0},{"$f":"IF(ISNA(VLOOKUP($A98,'GPIO Configuration'!$B$4:$J$97,9,FALSE)),0,MATCH(VLOOKUP($A98,'GPIO Configuration'!$B$4:$J$97,9,FALSE),INDIRECT($A98&\"_InLv\"),0)-1)","v":0},{"$f":"IF(ISNA(VLOOKUP($A98,'GPIO Configuration'!$B$4:$L$97,11,FALSE)),0,IF(VLOOKUP($A98,'GPIO Configuration'!$B$4:$L$97,11,FALSE)=\"1 - 使能\",1,0))","v":0},{"$f":"IF(ISNA(VLOOKUP($A98,'GPIO Configuration'!$B$4:$I$97,8,FALSE)),0,IF(VLOOKUP($A98,'GPIO Configuration'!$B$4:$I$97,8,FALSE)=\"上拉\",2,IF(VLOOKUP($A98,'GPIO Configuration'!$B$4:$I$97,8,FALSE)=\"下拉\",1,0)))","v":0},{"$f":"IF(ISNA(VLOOKUP($A98,'GPIO Configuration'!$B$4:$G$97,6,FALSE)),0,MATCH(VLOOKUP($A98,'GPIO Configuration'!$B$4:$G$97,6,FALSE),INDIRECT($A98&\"_Func\"),0)-1)","v":0},{"$f":"IF(ISNA(VLOOKUP($A98,'GPIO Configuration'!$B$4:$H$97,7,FALSE)),0,MATCH(VLOOKUP($A98,'GPIO Configuration'!$B$4:$H$97,7,FALSE),INDIRECT($A98&\"_OutDrv\"),0)-1)","v":0},{"$f":"IF(ISNA(VLOOKUP($A98,'GPIO Configuration'!$B$4:$M$97,12,FALSE)),0,IF(VLOOKUP($A98,'GPIO Configuration'!$B$4:$M$97,12,FALSE)=\"OUT - 输出\",1,0))","v":0},{"$f":"IF(ISNA(VLOOKUP($A98,'GPIO Configuration'!$B$4:$N$97,13,FALSE)),0,IF(VLOOKUP($A98,'GPIO Configuration'!$B$4:$N$97,13,FALSE)=\"1 - 高电平\",1,0))","v":0},{"$f":"IF(ISNA(VLOOKUP($A98,'GPIO Configuration'!$B$4:$S$97,18,FALSE)),0,IF(VLOOKUP($A98,'GPIO Configuration'!$B$4:$S$97,18,FALSE)=\"1 - 使能\",1,0))","v":0},{"$f":"IF(ISNA(VLOOKUP($A98,'GPIO Configuration'!$B$4:$R$97,17,FALSE)),0,MATCH(VLOOKUP($A98,'GPIO Configuration'!$B$4:$R$97,17,FALSE),INDIRECT($A98&\"_InLv\"),0)-1)","v":0},{"$f":"IF(ISNA(VLOOKUP($A98,'GPIO Configuration'!$B$4:$T$97,19,FALSE)),0,IF(VLOOKUP($A98,'GPIO Configuration'!$B$4:$T$97,19,FALSE)=\"1 - 使能\",1,0))","v":0},{"$f":"IF(ISNA(VLOOKUP($A98,'GPIO Configuration'!$B$4:$Q$97,16,FALSE)),0,IF(VLOOKUP($A98,'GPIO Configuration'!$B$4:$Q$97,16,FALSE)=\"上拉\",2,IF(VLOOKUP($A98,'GPIO Configuration'!$B$4:$Q$97,16,FALSE)=\"下拉\",1,0)))","v":0},{"$f":"IF(ISNA(VLOOKUP($A98,'GPIO Configuration'!$B$4:$O$97,14,FALSE)),0,MATCH(VLOOKUP($A98,'GPIO Configuration'!$B$4:$O$97,14,FALSE),INDIRECT($A98&\"_Func\"),0)-1)","v":0},{"$f":"IF(ISNA(VLOOKUP($A98,'GPIO Configuration'!$B$4:$P$97,15,FALSE)),0,MATCH(VLOOKUP($A98,'GPIO Configuration'!$B$4:$P$97,15,FALSE),INDIRECT($A98&\"_OutDrv\"),0)-1)","v":0}]
["P3_02",3,2,"0x0062","GPIO_PODR3_POD2","GPIO_PIDR3_PID2",{"$f":"IF(ISNA(VLOOKUP($A99,'GPIO Configuration'!$B$4:$C$97,2,FALSE)),0,1)","v":0},{"$f":"IF(ISNA(VLOOKUP($A99,'GPIO Configuration'!$B$4:$C$97,2,FALSE)),0,IF(VLOOKUP($A99,'GPIO Configuration'!$B$4:$C$97,2,FALSE)=\"是\",1,0))","v":0},{"$f":"IF(ISNA(VLOOKUP($A99,'GPIO Configuration'!$B$4:$D$97,3,FALSE)),\"\",TRIM(VLOOKUP($A99,'GPIO Configuration'!$B$4:$D$97,3,FALSE)))","v":""},{"$f":"IF(ISNA(VLOOKUP($A99,'GPIO Configuration'!$B$4:$E$97,4,FALSE)),0,IF(VLOOKUP($A99,'GPIO Configuration'!$B$4:$E$97,4,FALSE)=\"OUT - 输出\",1,0))","v":0},{"$f":"IF(ISNA(VLOOKUP($A99,'GPIO Configuration'!$B$4:$F$97,5,FALSE)),0,IF(VLOOKUP($A99,'GPIO Configuration'!$B$4:$F$97,5,FALSE)=\"1 - 高电平\",1,0))","v":0},{"$f":"IF(ISNA(VLOOKUP($A99,'GPIO Configuration'!$B$4:$K$97,10,FALSE)),0,IF(VLOOKUP($A99,'GPIO Configuration'!$B$4:$K$97,10,FALSE)=\"1 - 使能\",1,0))","v":0},{"$f":"IF(ISNA(VLOOKUP($A99,'GPIO Configuration'!$B$4:$J$97,9,FALSE)),0,MATCH(VLOOKUP($A99,'GPIO Configuration'!$B$4:$J$97,9,FALSE),INDIRECT($A99&\"_InLv\"),0)-1)","v":0},{"$f":"IF(ISNA(VLOOKUP($A99,'GPIO Configuration'!$B$4:$L$97,11,FALSE)),0,IF(VLOOKUP($A99,'GPIO Configuration'!$B$4:$L$97,11,FALSE)=\"1 - 使能\",1,0))","v":0},{"$f":"IF(ISNA(VLOOKUP($A99,'GPIO Configuration'!$B$4:$I$97,8,FALSE)),0,IF(VLOOKUP($A99,'GPIO Configuration'!$B$4:$I$97,8,FALSE)=\"上拉\",2,IF(VLOOKUP($A99,'GPIO Configuration'!$B$4:$I$97,8,FALSE)=\"下拉\",1,0)))","v":0},{"$f":"IF(ISNA(VLOOKUP($A99,'GPIO Configuration'!$B$4:$G$97,6,FALSE)),0,MATCH(VLOOKUP($A99,'GPIO Configuration'!$B$4:$G$97,6,FALSE),INDIRECT($A99&\"_Func\"),0)-1)","v":0},{"$f":"IF(ISNA(VLOOKUP($A99,'GPIO Configuration'!$B$4:$H$97,7,FALSE)),0,MATCH(VLOOKUP($A99,'GPIO Configuration'!$B$4:$H$97,7,FALSE),INDIRECT($A99&\"_OutDrv\"),0)-1)","v":0},{"$f":"IF(ISNA(VLOOKUP($A99,'GPIO Configuration'!$B$4:$M$97,12,FALSE)),0,IF(VLOOKUP($A99,'GPIO Configuration'!$B$4:$M$97,12,FALSE)=\"OUT - 输出\",1,0))","v":0},{"$f":"IF(ISNA(VLOOKUP($A99,'GPIO Configuration'!$B$4:$N$97,13,FALSE)),0,IF(VLOOKUP($A99,'GPIO Configuration'!$B$4:$N$97,13,FALSE)=\"1 - 高电平\",1,0))","v":0},{"$f":"IF(ISNA(VLOOKUP($A99,'GPIO Configuration'!$B$4:$S$97,18,FALSE)),0,IF(VLOOKUP($A99,'GPIO Configuration'!$B$4:$S$97,18,FALSE)=\"1 - 使能\",1,0))","v":0},{"$f":"IF(ISNA(VLOOKUP($A99,'GPIO Configuration'!$B$4:$R$97,17,FALSE)),0,MATCH(VLOOKUP($A99,'GPIO Configuration'!$B$4:$R$97,17,FALSE),INDIRECT($A99&\"_InLv\"),0)-1)","v":0},{"$f":"IF(ISNA(VLOOKUP($A99,'GPIO Configuration'!$B$4:$T$97,19,FALSE)),0,IF(VLOOKUP($A99,'GPIO Configuration'!$B$4:$T$97,19,FALSE)=\"1 - 使能\",1,0))","v":0},{"$f":"IF(ISNA(VLOOKUP($A99,'GPIO Configuration'!$B$4:$Q$97,16,FALSE)),0,IF(VLOOKUP($A99,'GPIO Configuration'!$B$4:$Q$97,16,FALSE)=\"上拉\",2,IF(VLOOKUP($A99,'GPIO Configuration'!$B$4:$Q$97,16,FALSE)=\"下拉\",1,0)))","v":0},{"$f":"IF(ISNA(VLOOKUP($A99,'GPIO Configuration'!$B$4:$O$97,14,FALSE)),0,MATCH(VLOOKUP($A99,'GPIO Configuration'!$B$4:$O$97,14,FALSE),INDIRECT($A99&\"_Func\"),0)-1)","v":0},{"$f":"IF(ISNA(VLOOKUP($A99,'GPIO Configuration'!$B$4:$P$97,15,FALSE)),0,MATCH(VLOOKUP($A99,'GPIO Configuration'!$B$4:$P$97,15,FALSE),INDIRECT($A99&\"_OutDrv\"),0)-1)","v":0}]
["P3_03",3,3,"0x0063","GPIO_PODR3_POD3","GPIO_PIDR3_PID3",{"$f":"IF(ISNA(VLOOKUP($A100,'GPIO Configuration'!$B$4:$C$97,2,FALSE)),0,1)","v":0},{"$f":"IF(ISNA(VLOOKUP($A100,'GPIO Configuration'!$B$4:$C$97,2,FALSE)),0,IF(VLOOKUP($A100,'GPIO Configuration'!$B$4:$C$97,2,FALSE)=\"是\",1,0))","v":0},{"$f":"IF(ISNA(VLOOKUP($A100,'GPIO Configuration'!$B$4:$D$97,3,FALSE)),\"\",TRIM(VLOOKUP($A100,'GPIO Configuration'!$B$4:$D$97,3,FALSE)))","v":""},{"$f":"IF(ISNA(VLOOKUP($A100,'GPIO Configuration'!$B$4:$E$97,4,FALSE)),0,IF(VLOOKUP($A100,'GPIO Configuration'!$B$4:$E$97,4,FALSE)=\"OUT - 输出\",1,0))","v":0},{"$f":"IF(ISNA(VLOOKUP($A100,'GPIO Configuration'!$B$4:$F$97,5,FALSE)),0,IF(VLOOKUP($A100,'GPIO Configuration'!$B$4:$F$97,5,FALSE)=\"1 - 高电平\",1,0))","v":0},{"$f":"IF(ISNA(VLOOKUP($A100,'GPIO Configuration'!$B$4:$K$97,10,FALSE)),0,IF(VLOOKUP($A100,'GPIO Configuration'!$B$4:$K$97,10,FALSE)=\"1 - 使能\",1,0))","v":0},{"$f":"IF(ISNA(VLOOKUP($A100,'GPIO Configuration'!$B$4:$J$97,9,FALSE)),0,MATCH(VLOOKUP($A100,'GPIO Configuration'!$B$4:$J$97,9,FALSE),INDIRECT($A100&\"_InLv\"),0)-1)","v":0},{"$f":"IF(ISNA(VLOOKUP($A100,'GPIO Configuration'!$B$4:$L$97,11,FALSE)),0,IF(VLOOKUP($A100,'GPIO Configuration'!$B$4:$L$97,11,FALSE)=\"1 - 使能\",1,0))","v":0},{"$f":"IF(ISNA(VLOOKUP($A100,'GPIO Configuration'!$B$4:$I$97,8,FALSE)),0,IF(VLOOKUP($A100,'GPIO Configuration'!$B$4:$I$97,8,FALSE)=\"上拉\",2,IF(VLOOKUP($A100,'GPIO Configuration'!$B$4:$I$97,8,FALSE)=\"下拉\",1,0)))","v":0},{"$f":"IF(ISNA(VLOOKUP($A100,'GPIO Configuration'!$B$4:$G$97,6,FALSE)),0,MATCH(VLOOKUP($A100,'GPIO Configuration'!$B$4:$G$97,6,FALSE),INDIRECT($A100&\"_Func\"),0)-1)","v":0},{"$f":"IF(ISNA(VLOOKUP($A100,'GPIO Configuration'!$B$4:$H$97,7,FALSE)),0,MATCH(VLOOKUP($A100,'GPIO Configuration'!$B$4:$H$97,7,FALSE),INDIRECT($A100&\"_OutDrv\"),0)-1)","v":0},{"$f":"IF(ISNA(VLOOKUP($A100,'GPIO Configuration'!$B$4:$M$97,12,FALSE)),0,IF(VLOOKUP($A100,'GPIO Configuration'!$B$4:$M$97,12,FALSE)=\"OUT - 输出\",1,0))","v":0},{"$f":"IF(ISNA(VLOOKUP($A100,'GPIO Configuration'!$B$4:$N$97,13,FALSE)),0,IF(VLOOKUP($A100,'GPIO Configuration'!$B$4:$N$97,13,FALSE)=\"1 - 高电平\",1,0))","v":0},{"$f":"IF(ISNA(VLOOKUP($A100,'GPIO Configuration'!$B$4:$S$97,18,FALSE)),0,IF(VLOOKUP($A100,'GPIO Configuration'!$B$4:$S$97,18,FALSE)=\"1 - 使能\",1,0))","v":0},{"$f":"IF(ISNA(VLOOKUP($A100,'GPIO Configuration'!$B$4:$R$97,17,FALSE)),0,MATCH(VLOOKUP($A100,'GPIO Configuration'!$B$4:$R$97,17,FALSE),INDIRECT($A100&\"_InLv\"),0)-1)","v":0},{"$f":"IF(ISNA(VLOOKUP($A100,'GPIO Configuration'!$B$4:$T$97,19,FALSE)),0,IF(VLOOKUP($A100,'GPIO Configuration'!$B$4:$T$97,19,FALSE)=\"1 - 使能\",1,0))","v":0},{"$f":"IF(ISNA(VLOOKUP($A100,'GPIO Configuration'!$B$4:$Q$97,16,FALSE)),0,IF(VLOOKUP($A100,'GPIO Configuration'!$B$4:$Q$97,16,FALSE)=\"上拉\",2,IF(VLOOKUP($A100,'GPIO Configuration'!$B$4:$Q$97,16,FALSE)=\"下拉\",1,0)))","v":0},{"$f":"IF(ISNA(VLOOKUP($A100,'GPIO Configuration'!$B$4:$O$97,14,FALSE)),0,MATCH(VLOOKUP($A100,'GPIO Configuration'!$B$4:$O$97,14,FALSE),INDIRECT($A100&\"_Func\"),0)-1)","v":0},{"$f":"IF(ISNA(VLOOKUP($A100,'GPIO Configuration'!$B$4:$P$97,15,FALSE)),0,MATCH(VLOOKUP($A100,'GPIO Configuration'!$B$4:$P$97,15,FALSE),INDIRECT($A100&\"_OutDrv\"),0)-1)","v":0}]
["P3_04",3,4,"0x0064","GPIO_PODR3_POD4","GPIO_PIDR3_PID4",{"$f":"IF(ISNA(VLOOKUP($A101,'GPIO Configuration'!$B$4:$C$97,2,FALSE)),0,1)","v":0},{"$f":"IF(ISNA(VLOOKUP($A101,'GPIO Configuration'!$B$4:$C$97,2,FALSE)),0,IF(VLOOKUP($A101,'GPIO Configuration'!$B$4:$C$97,2,FALSE)=\"是\",1,0))","v":0},{"$f":"IF(ISNA(VLOOKUP($A101,'GPIO Configuration'!$B$4:$D$97,3,FALSE)),\"\",TRIM(VLOOKUP($A101,'GPIO Configuration'!$B$4:$D$97,3,FALSE)))","v":""},{"$f":"IF(ISNA(VLOOKUP($A101,'GPIO Configuration'!$B$4:$E$97,4,FALSE)),0,IF(VLOOKUP($A101,'GPIO Configuration'!$B$4:$E$97,4,FALSE)=\"OUT - 输出\",1,0))","v":0},{"$f":"IF(ISNA(VLOOKUP($A101,'GPIO Configuration'!$B$4:$F$97,5,FALSE)),0,IF(VLOOKUP($A101,'GPIO Configuration'!$B$4:$F$97,5,FALSE)=\"1 - 高电平\",1,0))","v":0},{"$f":"IF(ISNA(VLOOKUP($A101,'GPIO Configuration'!$B$4:$K$97,10,FALSE)),0,IF(VLOOKUP($A101,'GPIO Configuration'!$B$4:$K$97,10,FALSE)=\"1 - 使能\",1,0))","v":0},{"$f":"IF(ISNA(VLOOKUP($A101,'GPIO Configuration'!$B$4:$J$97,9,FALSE)),0,MATCH(VLOOKUP($A101,'GPIO Configuration'!$B$4:$J$97,9,FALSE),INDIRECT($A101&\"_InLv\"),0)-1)","v":0},{"$f":"IF(ISNA(VLOOKUP($A101,'GPIO Configuration'!$B$4:$L$97,11,FALSE)),0,IF(VLOOKUP($A101,'GPIO Configuration'!$B$4:$L$97,11,FALSE)=\"1 - 使能\",1,0))","v":0},{"$f":"IF(ISNA(VLOOKUP($A101,'GPIO Configuration'!$B$4:$I$97,8,FALSE)),0,IF(VLOOKUP($A101,'GPIO Configuration'!$B$4:$I$97,8,FALSE)=\"上拉\",2,IF(VLOOKUP($A101,'GPIO Configuration'!$B$4:$I$97,8,FALSE)=\"下拉\",1,0)))","v":0},{"$f":"IF(ISNA(VLOOKUP($A101,'GPIO Configuration'!$B$4:$G$97,6,FALSE)),0,MATCH(VLOOKUP($A101,'GPIO Configuration'!$B$4:$G$97,6,FALSE),INDIRECT($A101&\"_Func\"),0)-1)","v":0},{"$f":"IF(ISNA(VLOOKUP($A101,'GPIO Configuration'!$B$4:$H$97,7,FALSE)),0,MATCH(VLOOKUP($A101,'GPIO Configuration'!$B$4:$H$97,7,FALSE),INDIRECT($A101&\"_OutDrv\"),0)-1)","v":0},{"$f":"IF(ISNA(VLOOKUP($A101,'GPIO Configuration'!$B$4:$M$97,12,FALSE)),0,IF(VLOOKUP($A101,'GPIO Configuration'!$B$4:$M$97,12,FALSE)=\"OUT - 输出\",1,0))","v":0},{"$f":"IF(ISNA(VLOOKUP($A101,'GPIO Configuration'!$B$4:$N$97,13,FALSE)),0,IF(VLOOKUP($A101,'GPIO Configuration'!$B$4:$N$97,13,FALSE)=\"1 - 高电平\",1,0))","v":0},{"$f":"IF(ISNA(VLOOKUP($A101,'GPIO Configuration'!$B$4:$S$97,18,FALSE)),0,IF(VLOOKUP($A101,'GPIO Configuration'!$B$4:$S$97,18,FALSE)=\"1 - 使能\",1,0))","v":0},{"$f":"IF(ISNA(VLOOKUP($A101,'GPIO Configuration'!$B$4:$R$97,17,FALSE)),0,MATCH(VLOOKUP($A101,'GPIO Configuration'!$B$4:$R$97,17,FALSE),INDIRECT($A101&\"_InLv\"),0)-1)","v":0},{"$f":"IF(ISNA(VLOOKUP($A101,'GPIO Configuration'!$B$4:$T$97,19,FALSE)),0,IF(VLOOKUP($A101,'GPIO Configuration'!$B$4:$T$97,19,FALSE)=\"1 - 使能\",1,0))","v":0},{"$f":"IF(ISNA(VLOOKUP($A101,'GPIO Configuration'!$B$4:$Q$97,16,FALSE)),0,IF(VLOOKUP($A101,'GPIO Configuration'!$B$4:$Q$97,16,FALSE)=\"上拉\",2,IF(VLOOKUP($A101,'GPIO Configuration'!$B$4:$Q$97,16,FALSE)=\"下拉\",1,0)))","v":0},{"$f":"IF(ISNA(VLOOKUP($A101,'GPIO Configuration'!$B$4:$O$97,14,FALSE)),0,MATCH(VLOOKUP($A101,'GPIO Configuration'!$B$4:$O$97,14,FALSE),INDIRECT($A101&\"_Func\"),0)-1)","v":0},{"$f":"IF(ISNA(VLOOKUP($A101,'GPIO Configuration'!$B$4:$P$97,15,FALSE)),0,MATCH(VLOOKUP($A101,'GPIO Configuration'!$B$4:$P$97,15,FALSE),INDIRECT($A101&\"_OutDrv\"),0)-1)","v":0}]
["P3_05",3,5,"0x0065","GPIO_PODR3_POD5","GPIO_PIDR3_PID5",{"$f":"IF(ISNA(VLOOKUP($A102,'GPIO Configuration'!$B$4:$C$97,2,FALSE)),0,1)","v":0},{"$f":"IF(ISNA(VLOOKUP($A102,'GPIO Configuration'!$B$4:$C$97,2,FALSE)),0,IF(VLOOKUP($A102,'GPIO Configuration'!$B$4:$C$97,2,FALSE)=\"是\",1,0))","v":0},{"$f":"IF(ISNA(VLOOKUP($A102,'GPIO Configuration'!$B$4:$D$97,3,FALSE)),\"\",TRIM(VLOOKUP($A102,'GPIO Configuration'!$B$4:$D$97,3,FALSE)))","v":""},{"$f":"IF(ISNA(VLOOKUP($A102,'GPIO Configuration'!$B$4:$E$97,4,FALSE)),0,IF(VLOOKUP($A102,'GPIO Configuration'!$B$4:$E$97,4,FALSE)=\"OUT - 输出\",1,0))","v":0},{"$f":"IF(ISNA(VLOOKUP($A102,'GPIO Configuration'!$B$4:$F$97,5,FALSE)),0,IF(VLOOKUP($A102,'GPIO Configuration'!$B$4:$F$97,5,FALSE)=\"1 - 高电平\",1,0))","v":0},{"$f":"IF(ISNA(VLOOKUP($A102,'GPIO Configuration'!$B$4:$K$97,10,FALSE)),0,IF(VLOOKUP($A102,'GPIO Configuration'!$B$4:$K$97,10,FALSE)=\"1 - 使能\",1,0))","v":0},{"$f":"IF(ISNA(VLOOKUP($A102,'GPIO Configuration'!$B$4:$J$97,9,FALSE)),0,MATCH(VLOOKUP($A102,'GPIO Configuration'!$B$4:$J$97,9,FALSE),INDIRECT($A102&\"_InLv\"),0)-1)","v":0},{"$f":"IF(ISNA(VLOOKUP($A102,'GPIO Configuration'!$B$4:$L$97,11,FALSE)),0,IF(VLOOKUP($A102,'GPIO Configuration'!$B$4:$L$97,11,FALSE)=\"1 - 使能\",1,0))","v":0},{"$f":"IF(ISNA(VLOOKUP($A102,'GPIO Configuration'!$B$4:$I$97,8,FALSE)),0,IF(VLOOKUP($A102,'GPIO Configuration'!$B$4:$I$97,8,FALSE)=\"上拉\",2,IF(VLOOKUP($A102,'GPIO Configuration'!$B$4:$I$97,8,FALSE)=\"下拉\",1,0)))","v":0},{"$f":"IF(ISNA(VLOOKUP($A102,'GPIO Configuration'!$B$4:$G$97,6,FALSE)),0,MATCH(VLOOKUP($A102,'GPIO Configuration'!$B$4:$G$97,6,FALSE),INDIRECT($A102&\"_Func\"),0)-1)","v":0},{"$f":"IF(ISNA(VLOOKUP($A102,'GPIO Configuration'!$B$4:$H$97,7,FALSE)),0,MATCH(VLOOKUP($A102,'GPIO Configuration'!$B$4:$H$97,7,FALSE),INDIRECT($A102&\"_OutDrv\"),0)-1)","v":0},{"$f":"IF(ISNA(VLOOKUP($A102,'GPIO Configuration'!$B$4:$M$97,12,FALSE)),0,IF(VLOOKUP($A102,'GPIO Configuration'!$B$4:$M$97,12,FALSE)=\"OUT - 输出\",1,0))","v":0},{"$f":"IF(ISNA(VLOOKUP($A102,'GPIO Configuration'!$B$4:$N$97,13,FALSE)),0,IF(VLOOKUP($A102,'GPIO Configuration'!$B$4:$N$97,13,FALSE)=\"1 - 高电平\",1,0))","v":0},{"$f":"IF(ISNA(VLOOKUP($A102,'GPIO Configuration'!$B$4:$S$97,18,FALSE)),0,IF(VLOOKUP($A102,'GPIO Configuration'!$B$4:$S$97,18,FALSE)=\"1 - 使能\",1,0))","v":0},{"$f":"IF(ISNA(VLOOKUP($A102,'GPIO Configuration'!$B$4:$R$97,17,FALSE)),0,MATCH(VLOOKUP($A102,'GPIO Configuration'!$B$4:$R$97,17,FALSE),INDIRECT($A102&\"_InLv\"),0)-1)","v":0},{"$f":"IF(ISNA(VLOOKUP($A102,'GPIO Configuration'!$B$4:$T$97,19,FALSE)),0,IF(VLOOKUP($A102,'GPIO Configuration'!$B$4:$T$97,19,FALSE)=\"1 - 使能\",1,0))","v":0},{"$f":"IF(ISNA(VLOOKUP($A102,'GPIO Configuration'!$B$4:$Q$97,16,FALSE)),0,IF(VLOOKUP($A102,'GPIO Configuration'!$B$4:$Q$97,16,FALSE)=\"上拉\",2,IF(VLOOKUP($A102,'GPIO Configuration'!$B$4:$Q$97,16,FALSE)=\"下拉\",1,0)))","v":0},{"$f":"IF(ISNA(VLOOKUP($A102,'GPIO Configuration'!$B$4:$O$97,14,FALSE)),0,MATCH(VLOOKUP($A102,'GPIO Configuration'!$B$4:$O$97,14,FALSE),INDIRECT($A102&\"_Func\"),0)-1)","v":0},{"$f":"IF(ISNA(VLOOKUP($A102,'GPIO Configuration'!$B$4:$P$97,15,FALSE)),0,MATCH(VLOOKUP($A102,'GPIO Configuration'!$B$4:$P$97,15,FALSE),INDIRECT($A102&\"_OutDrv\"),0)-1)","v":0}]
["P3_06",3,6,"0x0066","GPIO_PODR3_POD6","GPIO_PIDR3_PID6",{"$f":"IF(ISNA(VLOOKUP($A103,'GPIO Configuration'!$B$4:$C$97,2,FALSE)),0,1)","v":0},{"$f":"IF(ISNA(VLOOKUP($A103,'GPIO Configuration'!$B$4:$C$97,2,FALSE)),0,IF(VLOOKUP($A103,'GPIO Configuration'!$B$4:$C$97,2,FALSE)=\"是\",1,0))","v":0},{"$f":"IF(ISNA(VLOOKUP($A103,'GPIO Configuration'!$B$4:$D$97,3,FALSE)),\"\",TRIM(VLOOKUP($A103,'GPIO Configuration'!$B$4:$D$97,3,FALSE)))","v":""},{"$f":"IF(ISNA(VLOOKUP($A103,'GPIO Configuration'!$B$4:$E$97,4,FALSE)),0,IF(VLOOKUP($A103,'GPIO Configuration'!$B$4:$E$97,4,FALSE)=\"OUT - 输出\",1,0))","v":0},{"$f":"IF(ISNA(VLOOKUP($A103,'GPIO Configuration'!$B$4:$F$97,5,FALSE)),0,IF(VLOOKUP($A103,'GPIO Configuration'!$B$4:$F$97,5,FALSE)=\"1 - 高电平\",1,0))","v":0},{"$f":"IF(ISNA(VLOOKUP($A103,'GPIO Configuration'!$B$4:$K$97,10,FALSE)),0,IF(VLOOKUP($A103,'GPIO Configuration'!$B$4:$K$97,10,FALSE)=\"1 - 使能\",1,0))","v":0},{"$f":"IF(ISNA(VLOOKUP($A103,'GPIO Configuration'!$B$4:$J$97,9,FALSE)),0,MATCH(VLOOKUP($A103,'GPIO Configuration'!$B$4:$J$97,9,FALSE),INDIRECT($A103&\"_InLv\"),0)-1)","v":0},{"$f":"IF(ISNA(VLOOKUP($A103,'GPIO Configuration'!$B$4:$L$97,11,FALSE)),0,IF(VLOOKUP($A103,'GPIO Configuration'!$B$4:$L$97,11,FALSE)=\"1 - 使能\",1,0))","v":0},{"$f":"IF(ISNA(VLOOKUP($A103,'GPIO Configuration'!$B$4:$I$97,8,FALSE)),0,IF(VLOOKUP($A103,'GPIO Configuration'!$B$4:$I$97,8,FALSE)=\"上拉\",2,IF(VLOOKUP($A103,'GPIO Configuration'!$B$4:$I$97,8,FALSE)=\"下拉\",1,0)))","v":0},{"$f":"IF(ISNA(VLOOKUP($A103,'GPIO Configuration'!$B$4:$G$97,6,FALSE)),0,MATCH(VLOOKUP($A103,'GPIO Configuration'!$B$4:$G$97,6,FALSE),INDIRECT($A103&\"_Func\"),0)-1)","v":0},{"$f":"IF(ISNA(VLOOKUP($A103,'GPIO Configuration'!$B$4:$H$97,7,FALSE)),0,MATCH(VLOOKUP($A103,'GPIO Configuration'!$B$4:$H$97,7,FALSE),INDIRECT($A103&\"_OutDrv\"),0)-1)","v":0},{"$f":"IF(ISNA(VLOOKUP($A103,'GPIO Configuration'!$B$4:$M$97,12,FALSE)),0,IF(VLOOKUP($A103,'GPIO Configuration'!$B$4:$M$97,12,FALSE)=\"OUT - 输出\",1,0))","v":0},{"$f":"IF(ISNA(VLOOKUP($A103,'GPIO Configuration'!$B$4:$N$97,13,FALSE)),0,IF(VLOOKUP($A103,'GPIO Configuration'!$B$4:$N$97,13,FALSE)=\"1 - 高电平\",1,0))","v":0},{"$f":"IF(ISNA(VLOOKUP($A103,'GPIO Configuration'!$B$4:$S$97,18,FALSE)),0,IF(VLOOKUP($A103,'GPIO Configuration'!$B$4:$S$97,18,FALSE)=\"1 - 使能\",1,0))","v":0},{"$f":"IF(ISNA(VLOOKUP($A103,'GPIO Configuration'!$B$4:$R$97,17,FALSE)),0,MATCH(VLOOKUP($A103,'GPIO Configuration'!$B$4:$R$97,17,FALSE),INDIRECT($A103&\"_InLv\"),0)-1)","v":0},{"$f":"IF(ISNA(VLOOKUP($A103,'GPIO Configuration'!$B$4:$T$97,19,FALSE)),0,IF(VLOOKUP($A103,'GPIO Configuration'!$B$4:$T$97,19,FALSE)=\"1 - 使能\",1,0))","v":0},{"$f":"IF(ISNA(VLOOKUP($A103,'GPIO Configuration'!$B$4:$Q$97,16,FALSE)),0,IF(VLOOKUP($A103,'GPIO Configuration'!$B$4:$Q$97,16,FALSE)=\"上拉\",2,IF(VLOOKUP($A103,'GPIO Configuration'!$B$4:$Q$97,16,FALSE)=\"下拉\",1,0)))","v":0},{"$f":"IF(ISNA(VLOOKUP($A103,'GPIO Configuration'!$B$4:$O$97,14,FALSE)),0,MATCH(VLOOKUP($A103,'GPIO Configuration'!$B$4:$O$97,14,FALSE),INDIRECT($A103&\"_Func\"),0)-1)","v":0},{"$f":"IF(ISNA(VLOOKUP($A103,'GPIO Configuration'!$B$4:$P$97,15,FALSE)),0,MATCH(VLOOKUP($A103,'GPIO Configuration'!$B$4:$P$97,15,FALSE),INDIRECT($A103&\"_OutDrv\"),0)-1)","v":0}]
["P3_07",3,7,"0x0067","GPIO_PODR3_POD7","GPIO_PIDR3_PID7",{"$f":"IF(ISNA(VLOOKUP($A104,'GPIO Configuration'!$B$4:$C$97,2,FALSE)),0,1)","v":0},{"$f":"IF(ISNA(VLOOKUP($A104,'GPIO Configuration'!$B$4:$C$97,2,FALSE)),0,IF(VLOOKUP($A104,'GPIO Configuration'!$B$4:$C$97,2,FALSE)=\"是\",1,0))","v":0},{"$f":"IF(ISNA(VLOOKUP($A104,'GPIO Configuration'!$B$4:$D$97,3,FALSE)),\"\",TRIM(VLOOKUP($A104,'GPIO Configuration'!$B$4:$D$97,3,FALSE)))","v":""},{"$f":"IF(ISNA(VLOOKUP($A104,'GPIO Configuration'!$B$4:$E$97,4,FALSE)),0,IF(VLOOKUP($A104,'GPIO Configuration'!$B$4:$E$97,4,FALSE)=\"OUT - 输出\",1,0))","v":0},{"$f":"IF(ISNA(VLOOKUP($A104,'GPIO Configuration'!$B$4:$F$97,5,FALSE)),0,IF(VLOOKUP($A104,'GPIO Configuration'!$B$4:$F$97,5,FALSE)=\"1 - 高电平\",1,0))","v":0},{"$f":"IF(ISNA(VLOOKUP($A104,'GPIO Configuration'!$B$4:$K$97,10,FALSE)),0,IF(VLOOKUP($A104,'GPIO Configuration'!$B$4:$K$97,10,FALSE)=\"1 - 使能\",1,0))","v":0},{"$f":"IF(ISNA(VLOOKUP($A104,'GPIO Configuration'!$B$4:$J$97,9,FALSE)),0,MATCH(VLOOKUP($A104,'GPIO Configuration'!$B$4:$J$97,9,FALSE),INDIRECT($A104&\"_InLv\"),0)-1)","v":0},{"$f":"IF(ISNA(VLOOKUP($A104,'GPIO Configuration'!$B$4:$L$97,11,FALSE)),0,IF(VLOOKUP($A104,'GPIO Configuration'!$B$4:$L$97,11,FALSE)=\"1 - 使能\",1,0))","v":0},{"$f":"IF(ISNA(VLOOKUP($A104,'GPIO Configuration'!$B$4:$I$97,8,FALSE)),0,IF(VLOOKUP($A104,'GPIO Configuration'!$B$4:$I$97,8,FALSE)=\"上拉\",2,IF(VLOOKUP($A104,'GPIO Configuration'!$B$4:$I$97,8,FALSE)=\"下拉\",1,0)))","v":0},{"$f":"IF(ISNA(VLOOKUP($A104,'GPIO Configuration'!$B$4:$G$97,6,FALSE)),0,MATCH(VLOOKUP($A104,'GPIO Configuration'!$B$4:$G$97,6,FALSE),INDIRECT($A104&\"_Func\"),0)-1)","v":0},{"$f":"IF(ISNA(VLOOKUP($A104,'GPIO Configuration'!$B$4:$H$97,7,FALSE)),0,MATCH(VLOOKUP($A104,'GPIO Configuration'!$B$4:$H$97,7,FALSE),INDIRECT($A104&\"_OutDrv\"),0)-1)","v":0},{"$f":"IF(ISNA(VLOOKUP($A104,'GPIO Configuration'!$B$4:$M$97,12,FALSE)),0,IF(VLOOKUP($A104,'GPIO Configuration'!$B$4:$M$97,12,FALSE)=\"OUT - 输出\",1,0))","v":0},{"$f":"IF(ISNA(VLOOKUP($A104,'GPIO Configuration'!$B$4:$N$97,13,FALSE)),0,IF(VLOOKUP($A104,'GPIO Configuration'!$B$4:$N$97,13,FALSE)=\"1 - 高电平\",1,0))","v":0},{"$f":"IF(ISNA(VLOOKUP($A104,'GPIO Configuration'!$B$4:$S$97,18,FALSE)),0,IF(VLOOKUP($A104,'GPIO Configuration'!$B$4:$S$97,18,FALSE)=\"1 - 使能\",1,0))","v":0},{"$f":"IF(ISNA(VLOOKUP($A104,'GPIO Configuration'!$B$4:$R$97,17,FALSE)),0,MATCH(VLOOKUP($A104,'GPIO Configuration'!$B$4:$R$97,17,FALSE),INDIRECT($A104&\"_InLv\"),0)-1)","v":0},{"$f":"IF(ISNA(VLOOKUP($A104,'GPIO Configuration'!$B$4:$T$97,19,FALSE)),0,IF(VLOOKUP($A104,'GPIO Configuration'!$B$4:$T$97,19,FALSE)=\"1 - 使能\",1,0))","v":0},{"$f":"IF(ISNA(VLOOKUP($A104,'GPIO Configuration'!$B$4:$Q$97,16,FALSE)),0,IF(VLOOKUP($A104,'GPIO Configuration'!$B$4:$Q$97,16,FALSE)=\"上拉\",2,IF(VLOOKUP($A104,'GPIO Configuration'!$B$4:$Q$97,16,FALSE)=\"下拉\",1,0)))","v":0},{"$f":"IF(ISNA(VLOOKUP($A104,'GPIO Configuration'!$B$4:$O$97,14,FALSE)),0,MATCH(VLOOKUP($A104,'GPIO Configuration'!$B$4:$O$97,14,FALSE),INDIRECT($A104&\"_Func\"),0)-1)","v":0},{"$f":"IF(ISNA(VLOOKUP($A104,'GPIO Configuration'!$B$4:$P$97,15,FALSE)),0,MATCH(VLOOKUP($A104,'GPIO Configuration'!$B$4:$P$97,15,FALSE),INDIRECT($A104&\"_OutDrv\"),0)-1)","v":0}]
["P3_08",3,8,"0x0068","GPIO_PODR3_POD8","GPIO_PIDR3_PID8",{"$f":"IF(ISNA(VLOOKUP($A105,'GPIO Configuration'!$B$4:$C$97,2,FALSE)),0,1)","v":0},{"$f":"IF(ISNA(VLOOKUP($A105,'GPIO Configuration'!$B$4:$C$97,2,FALSE)),0,IF(VLOOKUP($A105,'GPIO Configuration'!$B$4:$C$97,2,FALSE)=\"是\",1,0))","v":0},{"$f":"IF(ISNA(VLOOKUP($A105,'GPIO Configuration'!$B$4:$D$97,3,FALSE)),\"\",TRIM(VLOOKUP($A105,'GPIO Configuration'!$B$4:$D$97,3,FALSE)))","v":""},{"$f":"IF(ISNA(VLOOKUP($A105,'GPIO Configuration'!$B$4:$E$97,4,FALSE)),0,IF(VLOOKUP($A105,'GPIO Configuration'!$B$4:$E$97,4,FALSE)=\"OUT - 输出\",1,0))","v":0},{"$f":"IF(ISNA(VLOOKUP($A105,'GPIO Configuration'!$B$4:$F$97,5,FALSE)),0,IF(VLOOKUP($A105,'GPIO Configuration'!$B$4:$F$97,5,FALSE)=\"1 - 高电平\",1,0))","v":0},{"$f":"IF(ISNA(VLOOKUP($A105,'GPIO Configuration'!$B$4:$K$97,10,FALSE)),0,IF(VLOOKUP($A105,'GPIO Configuration'!$B$4:$K$97,10,FALSE)=\"1 - 使能\",1,0))","v":0},{"$f":"IF(ISNA(VLOOKUP($A105,'GPIO Configuration'!$B$4:$J$97,9,FALSE)),0,MATCH(VLOOKUP($A105,'GPIO Configuration'!$B$4:$J$97,9,FALSE),INDIRECT($A105&\"_InLv\"),0)-1)","v":0},{"$f":"IF(ISNA(VLOOKUP($A105,'GPIO Configuration'!$B$4:$L$97,11,FALSE)),0,IF(VLOOKUP($A105,'GPIO Configuration'!$B$4:$L$97,11,FALSE)=\"1 - 使能\",1,0))","v":0},{"$f":"IF(ISNA(VLOOKUP($A105,'GPIO Configuration'!$B$4:$I$97,8,FALSE)),0,IF(VLOOKUP($A105,'GPIO Configuration'!$B$4:$I$97,8,FALSE)=\"上拉\",2,IF(VLOOKUP($A105,'GPIO Configuration'!$B$4:$I$97,8,FALSE)=\"下拉\",1,0)))","v":0},{"$f":"IF(ISNA(VLOOKUP($A105,'GPIO Configuration'!$B$4:$G$97,6,FALSE)),0,MATCH(VLOOKUP($A105,'GPIO Configuration'!$B$4:$G$97,6,FALSE),INDIRECT($A105&\"_Func\"),0)-1)","v":0},{"$f":"IF(ISNA(VLOOKUP($A105,'GPIO Configuration'!$B$4:$H$97,7,FALSE)),0,MATCH(VLOOKUP($A105,'GPIO Configuration'!$B$4:$H$97,7,FALSE),INDIRECT($A105&\"_OutDrv\"),0)-1)","v":0},{"$f":"IF(ISNA(VLOOKUP($A105,'GPIO Configuration'!$B$4:$M$97,12,FALSE)),0,IF(VLOOKUP($A105,'GPIO Configuration'!$B$4:$M$97,12,FALSE)=\"OUT - 输出\",1,0))","v":0},{"$f":"IF(ISNA(VLOOKUP($A105,'GPIO Configuration'!$B$4:$N$97,13,FALSE)),0,IF(VLOOKUP($A105,'GPIO Configuration'!$B$4:$N$97,13,FALSE)=\"1 - 高电平\",1,0))","v":0},{"$f":"IF(ISNA(VLOOKUP($A105,'GPIO Configuration'!$B$4:$S$97,18,FALSE)),0,IF(VLOOKUP($A105,'GPIO Configuration'!$B$4:$S$97,18,FALSE)=\"1 - 使能\",1,0))","v":0},{"$f":"IF(ISNA(VLOOKUP($A105,'GPIO Configuration'!$B$4:$R$97,17,FALSE)),0,MATCH(VLOOKUP($A105,'GPIO Configuration'!$B$4:$R$97,17,FALSE),INDIRECT($A105&\"_InLv\"),0)-1)","v":0},{"$f":"IF(ISNA(VLOOKUP($A105,'GPIO Configuration'!$B$4:$T$97,19,FALSE)),0,IF(VLOOKUP($A105,'GPIO Configuration'!$B$4:$T$97,19,FALSE)=\"1 - 使能\",1,0))","v":0},{"$f":"IF(ISNA(VLOOKUP($A105,'GPIO Configuration'!$B$4:$Q$97,16,FALSE)),0,IF(VLOOKUP($A105,'GPIO Configuration'!$B$4:$Q$97,16,FALSE)=\"上拉\",2,IF(VLOOKUP($A105,'GPIO Configuration'!$B$4:$Q$97,16,FALSE)=\"下拉\",1,0)))","v":0},{"$f":"IF(ISNA(VLOOKUP($A105,'GPIO Configuration'!$B$4:$O$97,14,FALSE)),0,MATCH(VLOOKUP($A105,'GPIO Configuration'!$B$4:$O$97,14,FALSE),INDIRECT($A105&\"_Func\"),0)-1)","v":0},{"$f":"IF(ISNA(VLOOKUP($A105,'GPIO Configuration'!$B$4:$P$97,15,FALSE)),0,MATCH(VLOOKUP($A105,'GPIO Configuration'!$B$4:$P$97,15,FALSE),INDIRECT($A105&\"_OutDrv\"),0)-1)","v":0}]
["P3_09",3,9,"0x0069","GPIO_PODR3_POD9","GPIO_PIDR3_PID9",{"$f":"IF(ISNA(VLOOKUP($A106,'GPIO Configuration'!$B$4:$C$97,2,FALSE)),0,1)","v":0},{"$f":"IF(ISNA(VLOOKUP($A106,'GPIO Configuration'!$B$4:$C$97,2,FALSE)),0,IF(VLOOKUP($A106,'GPIO Configuration'!$B$4:$C$97,2,FALSE)=\"是\",1,0))","v":0},{"$f":"IF(ISNA(VLOOKUP($A106,'GPIO Configuration'!$B$4:$D$97,3,FALSE)),\"\",TRIM(VLOOKUP($A106,'GPIO Configuration'!$B$4:$D$97,3,FALSE)))","v":""},{"$f":"IF(ISNA(VLOOKUP($A106,'GPIO Configuration'!$B$4:$E$97,4,FALSE)),0,IF(VLOOKUP($A106,'GPIO Configuration'!$B$4:$E$97,4,FALSE)=\"OUT - 输出\",1,0))","v":0},{"$f":"IF(ISNA(VLOOKUP($A106,'GPIO Configuration'!$B$4:$F$97,5,FALSE)),0,IF(VLOOKUP($A106,'GPIO Configuration'!$B$4:$F$97,5,FALSE)=\"1 - 高电平\",1,0))","v":0},{"$f":"IF(ISNA(VLOOKUP($A106,'GPIO Configuration'!$B$4:$K$97,10,FALSE)),0,IF(VLOOKUP($A106,'GPIO Configuration'!$B$4:$K$97,10,FALSE)=\"1 - 使能\",1,0))","v":0},{"$f":"IF(ISNA(VLOOKUP($A106,'GPIO Configuration'!$B$4:$J$97,9,FALSE)),0,MATCH(VLOOKUP($A106,'GPIO Configuration'!$B$4:$J$97,9,FALSE),INDIRECT($A106&\"_InLv\"),0)-1)","v":0},{"$f":"IF(ISNA(VLOOKUP($A106,'GPIO Configuration'!$B$4:$L$97,11,FALSE)),0,IF(VLOOKUP($A106,'GPIO Configuration'!$B$4:$L$97,11,FALSE)=\"1 - 使能\",1,0))","v":0},{"$f":"IF(ISNA(VLOOKUP($A106,'GPIO Configuration'!$B$4:$I$97,8,FALSE)),0,IF(VLOOKUP($A106,'GPIO Configuration'!$B$4:$I$97,8,FALSE)=\"上拉\",2,IF(VLOOKUP($A106,'GPIO Configuration'!$B$4:$I$97,8,FALSE)=\"下拉\",1,0)))","v":0},{"$f":"IF(ISNA(VLOOKUP($A106,'GPIO Configuration'!$B$4:$G$97,6,FALSE)),0,MATCH(VLOOKUP($A106,'GPIO Configuration'!$B$4:$G$97,6,FALSE),INDIRECT($A106&\"_Func\"),0)-1)","v":0},{"$f":"IF(ISNA(VLOOKUP($A106,'GPIO Configuration'!$B$4:$H$97,7,FALSE)),0,MATCH(VLOOKUP($A106,'GPIO Configuration'!$B$4:$H$97,7,FALSE),INDIRECT($A106&\"_OutDrv\"),0)-1)","v":0},{"$f":"IF(ISNA(VLOOKUP($A106,'GPIO Configuration'!$B$4:$M$97,12,FALSE)),0,IF(VLOOKUP($A106,'GPIO Configuration'!$B$4:$M$97,12,FALSE)=\"OUT - 输出\",1,0))","v":0},{"$f":"IF(ISNA(VLOOKUP($A106,'GPIO Configuration'!$B$4:$N$97,13,FALSE)),0,IF(VLOOKUP($A106,'GPIO Configuration'!$B$4:$N$97,13,FALSE)=\"1 - 高电平\",1,0))","v":0},{"$f":"IF(ISNA(VLOOKUP($A106,'GPIO Configuration'!$B$4:$S$97,18,FALSE)),0,IF(VLOOKUP($A106,'GPIO Configuration'!$B$4:$S$97,18,FALSE)=\"1 - 使能\",1,0))","v":0},{"$f":"IF(ISNA(VLOOKUP($A106,'GPIO Configuration'!$B$4:$R$97,17,FALSE)),0,MATCH(VLOOKUP($A106,'GPIO Configuration'!$B$4:$R$97,17,FALSE),INDIRECT($A106&\"_InLv\"),0)-1)","v":0},{"$f":"IF(ISNA(VLOOKUP($A106,'GPIO Configuration'!$B$4:$T$97,19,FALSE)),0,IF(VLOOKUP($A106,'GPIO Configuration'!$B$4:$T$97,19,FALSE)=\"1 - 使能\",1,0))","v":0},{"$f":"IF(ISNA(VLOOKUP($A106,'GPIO Configuration'!$B$4:$Q$97,16,FALSE)),0,IF(VLOOKUP($A106,'GPIO Configuration'!$B$4:$Q$97,16,FALSE)=\"上拉\",2,IF(VLOOKUP($A106,'GPIO Configuration'!$B$4:$Q$97,16,FALSE)=\"下拉\",1,0)))","v":0},{"$f":"IF(ISNA(VLOOKUP($A106,'GPIO Configuration'!$B$4:$O$97,14,FALSE)),0,MATCH(VLOOKUP($A106,'GPIO Configuration'!$B$4:$O$97,14,FALSE),INDIRECT($A106&\"_Func\"),0)-1)","v":0},{"$f":"IF(ISNA(VLOOKUP($A106,'GPIO Configuration'!$B$4:$P$97,15,FALSE)),0,MATCH(VLOOKUP($A106,'GPIO Configuration'!$B$4:$P$97,15,FALSE),INDIRECT($A106&\"_OutDrv\"),0)-1)","v":0}]
["P3_10",3,10,"0x006A","GPIO_PODR3_POD10","GPIO_PIDR3_PID10",{"$f":"IF(ISNA(VLOOKUP($A107,'GPIO Configuration'!$B$4:$C$97,2,FALSE)),0,1)","v":0},{"$f":"IF(ISNA(VLOOKUP($A107,'GPIO Configuration'!$B$4:$C$97,2,FALSE)),0,IF(VLOOKUP($A107,'GPIO Configuration'!$B$4:$C$97,2,FALSE)=\"是\",1,0))","v":0},{"$f":"IF(ISNA(VLOOKUP($A107,'GPIO Configuration'!$B$4:$D$97,3,FALSE)),\"\",TRIM(VLOOKUP($A107,'GPIO Configuration'!$B$4:$D$97,3,FALSE)))","v":""},{"$f":"IF(ISNA(VLOOKUP($A107,'GPIO Configuration'!$B$4:$E$97,4,FALSE)),0,IF(VLOOKUP($A107,'GPIO Configuration'!$B$4:$E$97,4,FALSE)=\"OUT - 输出\",1,0))","v":0},{"$f":"IF(ISNA(VLOOKUP($A107,'GPIO Configuration'!$B$4:$F$97,5,FALSE)),0,IF(VLOOKUP($A107,'GPIO Configuration'!$B$4:$F$97,5,FALSE)=\"1 - 高电平\",1,0))","v":0},{"$f":"IF(ISNA(VLOOKUP($A107,'GPIO Configuration'!$B$4:$K$97,10,FALSE)),0,IF(VLOOKUP($A107,'GPIO Configuration'!$B$4:$K$97,10,FALSE)=\"1 - 使能\",1,0))","v":0},{"$f":"IF(ISNA(VLOOKUP($A107,'GPIO Configuration'!$B$4:$J$97,9,FALSE)),0,MATCH(VLOOKUP($A107,'GPIO Configuration'!$B$4:$J$97,9,FALSE),INDIRECT($A107&\"_InLv\"),0)-1)","v":0},{"$f":"IF(ISNA(VLOOKUP($A107,'GPIO Configuration'!$B$4:$L$97,11,FALSE)),0,IF(VLOOKUP($A107,'GPIO Configuration'!$B$4:$L$97,11,FALSE)=\"1 - 使能\",1,0))","v":0},{"$f":"IF(ISNA(VLOOKUP($A107,'GPIO Configuration'!$B$4:$I$97,8,FALSE)),0,IF(VLOOKUP($A107,'GPIO Configuration'!$B$4:$I$97,8,FALSE)=\"上拉\",2,IF(VLOOKUP($A107,'GPIO Configuration'!$B$4:$I$97,8,FALSE)=\"下拉\",1,0)))","v":0},{"$f":"IF(ISNA(VLOOKUP($A107,'GPIO Configuration'!$B$4:$G$97,6,FALSE)),0,MATCH(VLOOKUP($A107,'GPIO Configuration'!$B$4:$G$97,6,FALSE),INDIRECT($A107&\"_Func\"),0)-1)","v":0},{"$f":"IF(ISNA(VLOOKUP($A107,'GPIO Configuration'!$B$4:$H$97,7,FALSE)),0,MATCH(VLOOKUP($A107,'GPIO Configuration'!$B$4:$H$97,7,FALSE),INDIRECT($A107&\"_OutDrv\"),0)-1)","v":0},{"$f":"IF(ISNA(VLOOKUP($A107,'GPIO Configuration'!$B$4:$M$97,12,FALSE)),0,IF(VLOOKUP($A107,'GPIO Configuration'!$B$4:$M$97,12,FALSE)=\"OUT - 输出\",1,0))","v":0},{"$f":"IF(ISNA(VLOOKUP($A107,'GPIO Configuration'!$B$4:$N$97,13,FALSE)),0,IF(VLOOKUP($A107,'GPIO Configuration'!$B$4:$N$97,13,FALSE)=\"1 - 高电平\",1,0))","v":0},{"$f":"IF(ISNA(VLOOKUP($A107,'GPIO Configuration'!$B$4:$S$97,18,FALSE)),0,IF(VLOOKUP($A107,'GPIO Configuration'!$B$4:$S$97,18,FALSE)=\"1 - 使能\",1,0))","v":0},{"$f":"IF(ISNA(VLOOKUP($A107,'GPIO Configuration'!$B$4:$R$97,17,FALSE)),0,MATCH(VLOOKUP($A107,'GPIO Configuration'!$B$4:$R$97,17,FALSE),INDIRECT($A107&\"_InLv\"),0)-1)","v":0},{"$f":"IF(ISNA(VLOOKUP($A107,'GPIO Configuration'!$B$4:$T$97,19,FALSE)),0,IF(VLOOKUP($A107,'GPIO Configuration'!$B$4:$T$97,19,FALSE)=\"1 - 使能\",1,0))","v":0},{"$f":"IF(ISNA(VLOOKUP($A107,'GPIO Configuration'!$B$4:$Q$97,16,FALSE)),0,IF(VLOOKUP($A107,'GPIO Configuration'!$B$4:$Q$97,16,FALSE)=\"上拉\",2,IF(VLOOKUP($A107,'GPIO Configuration'!$B$4:$Q$97,16,FALSE)=\"下拉\",1,0)))","v":0},{"$f":"IF(ISNA(VLOOKUP($A107,'GPIO Configuration'!$B$4:$O$97,14,FALSE)),0,MATCH(VLOOKUP($A107,'GPIO Configuration'!$B$4:$O$97,14,FALSE),INDIRECT($A107&\"_Func\"),0)-1)","v":0},{"$f":"IF(ISNA(VLOOKUP($A107,'GPIO Configuration'!$B$4:$P$97,15,FALSE)),0,MATCH(VLOOKUP($A107,'GPIO Configuration'!$B$4:$P$97,15,FALSE),INDIRECT($A107&\"_OutDrv\"),0)-1)","v":0}]
["P3_11",3,11,"0x006B","GPIO_PODR3_POD11","GPIO_PIDR3_PID11",{"$f":"IF(ISNA(VLOOKUP($A108,'GPIO Configuration'!$B$4:$C$97,2,FALSE)),0,1)","v":0},{"$f":"IF(ISNA(VLOOKUP($A108,'GPIO Configuration'!$B$4:$C$97,2,FALSE)),0,IF(VLOOKUP($A108,'GPIO Configuration'!$B$4:$C$97,2,FALSE)=\"是\",1,0))","v":0},{"$f":"IF(ISNA(VLOOKUP($A108,'GPIO Configuration'!$B$4:$D$97,3,FALSE)),\"\",TRIM(VLOOKUP($A108,'GPIO Configuration'!$B$4:$D$97,3,FALSE)))","v":""},{"$f":"IF(ISNA(VLOOKUP($A108,'GPIO Configuration'!$B$4:$E$97,4,FALSE)),0,IF(VLOOKUP($A108,'GPIO Configuration'!$B$4:$E$97,4,FALSE)=\"OUT - 输出\",1,0))","v":0},{"$f":"IF(ISNA(VLOOKUP($A108,'GPIO Configuration'!$B$4:$F$97,5,FALSE)),0,IF(VLOOKUP($A108,'GPIO Configuration'!$B$4:$F$97,5,FALSE)=\"1 - 高电平\",1,0))","v":0},{"$f":"IF(ISNA(VLOOKUP($A108,'GPIO Configuration'!$B$4:$K$97,10,FALSE)),0,IF(VLOOKUP($A108,'GPIO Configuration'!$B$4:$K$97,10,FALSE)=\"1 - 使能\",1,0))","v":0},{"$f":"IF(ISNA(VLOOKUP($A108,'GPIO Configuration'!$B$4:$J$97,9,FALSE)),0,MATCH(VLOOKUP($A108,'GPIO Configuration'!$B$4:$J$97,9,FALSE),INDIRECT($A108&\"_InLv\"),0)-1)","v":0},{"$f":"IF(ISNA(VLOOKUP($A108,'GPIO Configuration'!$B$4:$L$97,11,FALSE)),0,IF(VLOOKUP($A108,'GPIO Configuration'!$B$4:$L$97,11,FALSE)=\"1 - 使能\",1,0))","v":0},{"$f":"IF(ISNA(VLOOKUP($A108,'GPIO Configuration'!$B$4:$I$97,8,FALSE)),0,IF(VLOOKUP($A108,'GPIO Configuration'!$B$4:$I$97,8,FALSE)=\"上拉\",2,IF(VLOOKUP($A108,'GPIO Configuration'!$B$4:$I$97,8,FALSE)=\"下拉\",1,0)))","v":0},{"$f":"IF(ISNA(VLOOKUP($A108,'GPIO Configuration'!$B$4:$G$97,6,FALSE)),0,MATCH(VLOOKUP($A108,'GPIO Configuration'!$B$4:$G$97,6,FALSE),INDIRECT($A108&\"_Func\"),0)-1)","v":0},{"$f":"IF(ISNA(VLOOKUP($A108,'GPIO Configuration'!$B$4:$H$97,7,FALSE)),0,MATCH(VLOOKUP($A108,'GPIO Configuration'!$B$4:$H$97,7,FALSE),INDIRECT($A108&\"_OutDrv\"),0)-1)","v":0},{"$f":"IF(ISNA(VLOOKUP($A108,'GPIO Configuration'!$B$4:$M$97,12,FALSE)),0,IF(VLOOKUP($A108,'GPIO Configuration'!$B$4:$M$97,12,FALSE)=\"OUT - 输出\",1,0))","v":0},{"$f":"IF(ISNA(VLOOKUP($A108,'GPIO Configuration'!$B$4:$N$97,13,FALSE)),0,IF(VLOOKUP($A108,'GPIO Configuration'!$B$4:$N$97,13,FALSE)=\"1 - 高电平\",1,0))","v":0},{"$f":"IF(ISNA(VLOOKUP($A108,'GPIO Configuration'!$B$4:$S$97,18,FALSE)),0,IF(VLOOKUP($A108,'GPIO Configuration'!$B$4:$S$97,18,FALSE)=\"1 - 使能\",1,0))","v":0},{"$f":"IF(ISNA(VLOOKUP($A108,'GPIO Configuration'!$B$4:$R$97,17,FALSE)),0,MATCH(VLOOKUP($A108,'GPIO Configuration'!$B$4:$R$97,17,FALSE),INDIRECT($A108&\"_InLv\"),0)-1)","v":0},{"$f":"IF(ISNA(VLOOKUP($A108,'GPIO Configuration'!$B$4:$T$97,19,FALSE)),0,IF(VLOOKUP($A108,'GPIO Configuration'!$B$4:$T$97,19,FALSE)=\"1 - 使能\",1,0))","v":0},{"$f":"IF(ISNA(VLOOKUP($A108,'GPIO Configuration'!$B$4:$Q$97,16,FALSE)),0,IF(VLOOKUP($A108,'GPIO Configuration'!$B$4:$Q$97,16,FALSE)=\"上拉\",2,IF(VLOOKUP($A108,'GPIO Configuration'!$B$4:$Q$97,16,FALSE)=\"下拉\",1,0)))","v":0},{"$f":"IF(ISNA(VLOOKUP($A108,'GPIO Configuration'!$B$4:$O$97,14,FALSE)),0,MATCH(VLOOKUP($A108,'GPIO Configuration'!$B$4:$O$97,14,FALSE),INDIRECT($A108&\"_Func\"),0)-1)","v":0},{"$f":"IF(ISNA(VLOOKUP($A108,'GPIO Configuration'!$B$4:$P$97,15,FALSE)),0,MATCH(VLOOKUP($A108,'GPIO Configuration'!$B$4:$P$97,15,FALSE),INDIRECT($A108&\"_OutDrv\"),0)-1)","v":0}]
["P3_12",3,12,"0x006C","GPIO_PODR3_POD12","GPIO_PIDR3_PID12",{"$f":"IF(ISNA(VLOOKUP($A109,'GPIO Configuration'!$B$4:$C$97,2,FALSE)),0,1)","v":0},{"$f":"IF(ISNA(VLOOKUP($A109,'GPIO Configuration'!$B$4:$C$97,2,FALSE)),0,IF(VLOOKUP($A109,'GPIO Configuration'!$B$4:$C$97,2,FALSE)=\"是\",1,0))","v":0},{"$f":"IF(ISNA(VLOOKUP($A109,'GPIO Configuration'!$B$4:$D$97,3,FALSE)),\"\",TRIM(VLOOKUP($A109,'GPIO Configuration'!$B$4:$D$97,3,FALSE)))","v":""},{"$f":"IF(ISNA(VLOOKUP($A109,'GPIO Configuration'!$B$4:$E$97,4,FALSE)),0,IF(VLOOKUP($A109,'GPIO Configuration'!$B$4:$E$97,4,FALSE)=\"OUT - 输出\",1,0))","v":0},{"$f":"IF(ISNA(VLOOKUP($A109,'GPIO Configuration'!$B$4:$F$97,5,FALSE)),0,IF(VLOOKUP($A109,'GPIO Configuration'!$B$4:$F$97,5,FALSE)=\"1 - 高电平\",1,0))","v":0},{"$f":"IF(ISNA(VLOOKUP($A109,'GPIO Configuration'!$B$4:$K$97,10,FALSE)),0,IF(VLOOKUP($A109,'GPIO Configuration'!$B$4:$K$97,10,FALSE)=\"1 - 使能\",1,0))","v":0},{"$f":"IF(ISNA(VLOOKUP($A109,'GPIO Configuration'!$B$4:$J$97,9,FALSE)),0,MATCH(VLOOKUP($A109,'GPIO Configuration'!$B$4:$J$97,9,FALSE),INDIRECT($A109&\"_InLv\"),0)-1)","v":0},{"$f":"IF(ISNA(VLOOKUP($A109,'GPIO Configuration'!$B$4:$L$97,11,FALSE)),0,IF(VLOOKUP($A109,'GPIO Configuration'!$B$4:$L$97,11,FALSE)=\"1 - 使能\",1,0))","v":0},{"$f":"IF(ISNA(VLOOKUP($A109,'GPIO Configuration'!$B$4:$I$97,8,FALSE)),0,IF(VLOOKUP($A109,'GPIO Configuration'!$B$4:$I$97,8,FALSE)=\"上拉\",2,IF(VLOOKUP($A109,'GPIO Configuration'!$B$4:$I$97,8,FALSE)=\"下拉\",1,0)))","v":0},{"$f":"IF(ISNA(VLOOKUP($A109,'GPIO Configuration'!$B$4:$G$97,6,FALSE)),0,MATCH(VLOOKUP($A109,'GPIO Configuration'!$B$4:$G$97,6,FALSE),INDIRECT($A109&\"_Func\"),0)-1)","v":0},{"$f":"IF(ISNA(VLOOKUP($A109,'GPIO Configuration'!$B$4:$H$97,7,FALSE)),0,MATCH(VLOOKUP($A109,'GPIO Configuration'!$B$4:$H$97,7,FALSE),INDIRECT($A109&\"_OutDrv\"),0)-1)","v":0},{"$f":"IF(ISNA(VLOOKUP($A109,'GPIO Configuration'!$B$4:$M$97,12,FALSE)),0,IF(VLOOKUP($A109,'GPIO Configuration'!$B$4:$M$97,12,FALSE)=\"OUT - 输出\",1,0))","v":0},{"$f":"IF(ISNA(VLOOKUP($A109,'GPIO Configuration'!$B$4:$N$97,13,FALSE)),0,IF(VLOOKUP($A109,'GPIO Configuration'!$B$4:$N$97,13,FALSE)=\"1 - 高电平\",1,0))","v":0},{"$f":"IF(ISNA(VLOOKUP($A109,'GPIO Configuration'!$B$4:$S$97,18,FALSE)),0,IF(VLOOKUP($A109,'GPIO Configuration'!$B$4:$S$97,18,FALSE)=\"1 - 使能\",1,0))","v":0},{"$f":"IF(ISNA(VLOOKUP($A109,'GPIO Configuration'!$B$4:$R$97,17,FALSE)),0,MATCH(VLOOKUP($A109,'GPIO Configuration'!$B$4:$R$97,17,FALSE),INDIRECT($A109&\"_InLv\"),0)-1)","v":0},{"$f":"IF(ISNA(VLOOKUP($A109,'GPIO Configuration'!$B$4:$T$97,19,FALSE)),0,IF(VLOOKUP($A109,'GPIO Configuration'!$B$4:$T$97,19,FALSE)=\"1 - 使能\",1,0))","v":0},{"$f":"IF(ISNA(VLOOKUP($A109,'GPIO Configuration'!$B$4:$Q$97,16,FALSE)),0,IF(VLOOKUP($A109,'GPIO Configuration'!$B$4:$Q$97,16,FALSE)=\"上拉\",2,IF(VLOOKUP($A109,'GPIO Configuration'!$B$4:$Q$97,16,FALSE)=\"下拉\",1,0)))","v":0},{"$f":"IF(ISNA(VLOOKUP($A109,'GPIO Configuration'!$B$4:$O$97,14,FALSE)),0,MATCH(VLOOKUP($A109,'GPIO Configuration'!$B$4:$O$97,14,FALSE),INDIRECT($A109&\"_Func\"),0)-1)","v":0},{"$f":"IF(ISNA(VLOOKUP($A109,'GPIO Configuration'!$B$4:$P$97,15,FALSE)),0,MATCH(VLOOKUP($A109,'GPIO Configuration'!$B$4:$P$97,15,FALSE),INDIRECT($A109&\"_OutDrv\"),0)-1)","v":0}]
["P3_13",3,13,"0x006D","GPIO_PODR3_POD13","GPIO_PIDR3_PID13",{"$f":"IF(ISNA(VLOOKUP($A110,'GPIO Configuration'!$B$4:$C$97,2,FALSE)),0,1)","v":0},{"$f":"IF(ISNA(VLOOKUP($A110,'GPIO Configuration'!$B$4:$C$97,2,FALSE)),0,IF(VLOOKUP($A110,'GPIO Configuration'!$B$4:$C$97,2,FALSE)=\"是\",1,0))","v":0},{"$f":"IF(ISNA(VLOOKUP($A110,'GPIO Configuration'!$B$4:$D$97,3,FALSE)),\"\",TRIM(VLOOKUP($A110,'GPIO Configuration'!$B$4:$D$97,3,FALSE)))","v":""},{"$f":"IF(ISNA(VLOOKUP($A110,'GPIO Configuration'!$B$4:$E$97,4,FALSE)),0,IF(VLOOKUP($A110,'GPIO Configuration'!$B$4:$E$97,4,FALSE)=\"OUT - 输出\",1,0))","v":0},{"$f":"IF(ISNA(VLOOKUP($A110,'GPIO Configuration'!$B$4:$F$97,5,FALSE)),0,IF(VLOOKUP($A110,'GPIO Configuration'!$B$4:$F$97,5,FALSE)=\"1 - 高电平\",1,0))","v":0},{"$f":"IF(ISNA(VLOOKUP($A110,'GPIO Configuration'!$B$4:$K$97,10,FALSE)),0,IF(VLOOKUP($A110,'GPIO Configuration'!$B$4:$K$97,10,FALSE)=\"1 - 使能\",1,0))","v":0},{"$f":"IF(ISNA(VLOOKUP($A110,'GPIO Configuration'!$B$4:$J$97,9,FALSE)),0,MATCH(VLOOKUP($A110,'GPIO Configuration'!$B$4:$J$97,9,FALSE),INDIRECT($A110&\"_InLv\"),0)-1)","v":0},{"$f":"IF(ISNA(VLOOKUP($A110,'GPIO Configuration'!$B$4:$L$97,11,FALSE)),0,IF(VLOOKUP($A110,'GPIO Configuration'!$B$4:$L$97,11,FALSE)=\"1 - 使能\",1,0))","v":0},{"$f":"IF(ISNA(VLOOKUP($A110,'GPIO Configuration'!$B$4:$I$97,8,FALSE)),0,IF(VLOOKUP($A110,'GPIO Configuration'!$B$4:$I$97,8,FALSE)=\"上拉\",2,IF(VLOOKUP($A110,'GPIO Configuration'!$B$4:$I$97,8,FALSE)=\"下拉\",1,0)))","v":0},{"$f":"IF(ISNA(VLOOKUP($A110,'GPIO Configuration'!$B$4:$G$97,6,FALSE)),0,MATCH(VLOOKUP($A110,'GPIO Configuration'!$B$4:$G$97,6,FALSE),INDIRECT($A110&\"_Func\"),0)-1)","v":0},{"$f":"IF(ISNA(VLOOKUP($A110,'GPIO Configuration'!$B$4:$H$97,7,FALSE)),0,MATCH(VLOOKUP($A110,'GPIO Configuration'!$B$4:$H$97,7,FALSE),INDIRECT($A110&\"_OutDrv\"),0)-1)","v":0},{"$f":"IF(ISNA(VLOOKUP($A110,'GPIO Configuration'!$B$4:$M$97,12,FALSE)),0,IF(VLOOKUP($A110,'GPIO Configuration'!$B$4:$M$97,12,FALSE)=\"OUT - 输出\",1,0))","v":0},{"$f":"IF(ISNA(VLOOKUP($A110,'GPIO Configuration'!$B$4:$N$97,13,FALSE)),0,IF(VLOOKUP($A110,'GPIO Configuration'!$B$4:$N$97,13,FALSE)=\"1 - 高电平\",1,0))","v":0},{"$f":"IF(ISNA(VLOOKUP($A110,'GPIO Configuration'!$B$4:$S$97,18,FALSE)),0,IF(VLOOKUP($A110,'GPIO Configuration'!$B$4:$S$97,18,FALSE)=\"1 - 使能\",1,0))","v":0},{"$f":"IF(ISNA(VLOOKUP($A110,'GPIO Configuration'!$B$4:$R$97,17,FALSE)),0,MATCH(VLOOKUP($A110,'GPIO Configuration'!$B$4:$R$97,17,FALSE),INDIRECT($A110&\"_InLv\"),0)-1)","v":0},{"$f":"IF(ISNA(VLOOKUP($A110,'GPIO Configuration'!$B$4:$T$97,19,FALSE)),0,IF(VLOOKUP($A110,'GPIO Configuration'!$B$4:$T$97,19,FALSE)=\"1 - 使能\",1,0))","v":0},{"$f":"IF(ISNA(VLOOKUP($A110,'GPIO Configuration'!$B$4:$Q$97,16,FALSE)),0,IF(VLOOKUP($A110,'GPIO Configuration'!$B$4:$Q$97,16,FALSE)=\"上拉\",2,IF(VLOOKUP($A110,'GPIO Configuration'!$B$4:$Q$97,16,FALSE)=\"下拉\",1,0)))","v":0},{"$f":"IF(ISNA(VLOOKUP($A110,'GPIO Configuration'!$B$4:$O$97,14,FALSE)),0,MATCH(VLOOKUP($A110,'GPIO Configuration'!$B$4:$O$97,14,FALSE),INDIRECT($A110&\"_Func\"),0)-1)","v":0},{"$f":"IF(ISNA(VLOOKUP($A110,'GPIO Configuration'!$B$4:$P$97,15,FALSE)),0,MATCH(VLOOKUP($A110,'GPIO Configuration'!$B$4:$P$97,15,FALSE),INDIRECT($A110&\"_OutDrv\"),0)-1)","v":0}]
["P3_14",3,14,"0x006E","GPIO_PODR3_POD14","GPIO_PIDR3_PID14",{"$f":"IF(ISNA(VLOOKUP($A111,'GPIO Configuration'!$B$4:$C$97,2,FALSE)),0,1)","v":0},{"$f":"IF(ISNA(VLOOKUP($A111,'GPIO Configuration'!$B$4:$C$97,2,FALSE)),0,IF(VLOOKUP($A111,'GPIO Configuration'!$B$4:$C$97,2,FALSE)=\"是\",1,0))","v":0},{"$f":"IF(ISNA(VLOOKUP($A111,'GPIO Configuration'!$B$4:$D$97,3,FALSE)),\"\",TRIM(VLOOKUP($A111,'GPIO Configuration'!$B$4:$D$97,3,FALSE)))","v":""},{"$f":"IF(ISNA(VLOOKUP($A111,'GPIO Configuration'!$B$4:$E$97,4,FALSE)),0,IF(VLOOKUP($A111,'GPIO Configuration'!$B$4:$E$97,4,FALSE)=\"OUT - 输出\",1,0))","v":0},{"$f":"IF(ISNA(VLOOKUP($A111,'GPIO Configuration'!$B$4:$F$97,5,FALSE)),0,IF(VLOOKUP($A111,'GPIO Configuration'!$B$4:$F$97,5,FALSE)=\"1 - 高电平\",1,0))","v":0},{"$f":"IF(ISNA(VLOOKUP($A111,'GPIO Configuration'!$B$4:$K$97,10,FALSE)),0,IF(VLOOKUP($A111,'GPIO Configuration'!$B$4:$K$97,10,FALSE)=\"1 - 使能\",1,0))","v":0},{"$f":"IF(ISNA(VLOOKUP($A111,'GPIO Configuration'!$B$4:$J$97,9,FALSE)),0,MATCH(VLOOKUP($A111,'GPIO Configuration'!$B$4:$J$97,9,FALSE),INDIRECT($A111&\"_InLv\"),0)-1)","v":0},{"$f":"IF(ISNA(VLOOKUP($A111,'GPIO Configuration'!$B$4:$L$97,11,FALSE)),0,IF(VLOOKUP($A111,'GPIO Configuration'!$B$4:$L$97,11,FALSE)=\"1 - 使能\",1,0))","v":0},{"$f":"IF(ISNA(VLOOKUP($A111,'GPIO Configuration'!$B$4:$I$97,8,FALSE)),0,IF(VLOOKUP($A111,'GPIO Configuration'!$B$4:$I$97,8,FALSE)=\"上拉\",2,IF(VLOOKUP($A111,'GPIO Configuration'!$B$4:$I$97,8,FALSE)=\"下拉\",1,0)))","v":0},{"$f":"IF(ISNA(VLOOKUP($A111,'GPIO Configuration'!$B$4:$G$97,6,FALSE)),0,MATCH(VLOOKUP($A111,'GPIO Configuration'!$B$4:$G$97,6,FALSE),INDIRECT($A111&\"_Func\"),0)-1)","v":0},{"$f":"IF(ISNA(VLOOKUP($A111,'GPIO Configuration'!$B$4:$H$97,7,FALSE)),0,MATCH(VLOOKUP($A111,'GPIO Configuration'!$B$4:$H$97,7,FALSE),INDIRECT($A111&\"_OutDrv\"),0)-1)","v":0},{"$f":"IF(ISNA(VLOOKUP($A111,'GPIO Configuration'!$B$4:$M$97,12,FALSE)),0,IF(VLOOKUP($A111,'GPIO Configuration'!$B$4:$M$97,12,FALSE)=\"OUT - 输出\",1,0))","v":0},{"$f":"IF(ISNA(VLOOKUP($A111,'GPIO Configuration'!$B$4:$N$97,13,FALSE)),0,IF(VLOOKUP($A111,'GPIO Configuration'!$B$4:$N$97,13,FALSE)=\"1 - 高电平\",1,0))","v":0},{"$f":"IF(ISNA(VLOOKUP($A111,'GPIO Configuration'!$B$4:$S$97,18,FALSE)),0,IF(VLOOKUP($A111,'GPIO Configuration'!$B$4:$S$97,18,FALSE)=\"1 - 使能\",1,0))","v":0},{"$f":"IF(ISNA(VLOOKUP($A111,'GPIO Configuration'!$B$4:$R$97,17,FALSE)),0,MATCH(VLOOKUP($A111,'GPIO Configuration'!$B$4:$R$97,17,FALSE),INDIRECT($A111&\"_InLv\"),0)-1)","v":0},{"$f":"IF(ISNA(VLOOKUP($A111,'GPIO Configuration'!$B$4:$T$97,19,FALSE)),0,IF(VLOOKUP($A111,'GPIO Configuration'!$B$4:$T$97,19,FALSE)=\"1 - 使能\",1,0))","v":0},{"$f":"IF(ISNA(VLOOKUP($A111,'GPIO Configuration'!$B$4:$Q$97,16,FALSE)),0,IF(VLOOKUP($A111,'GPIO Configuration'!$B$4:$Q$97,16,FALSE)=\"上拉\",2,IF(VLOOKUP($A111,'GPIO Configuration'!$B$4:$Q$97,16,FALSE)=\"下拉\",1,0)))","v":0},{"$f":"IF(ISNA(VLOOKUP($A111,'GPIO Configuration'!$B$4:$O$97,14,FALSE)),0,MATCH(VLOOKUP($A111,'GPIO Configuration'!$B$4:$O$97,14,FALSE),INDIRECT($A111&\"_Func\"),0)-1)","v":0},{"$f":"IF(ISNA(VLOOKUP($A111,'GPIO Configuration'!$B$4:$P$97,15,FALSE)),0,MATCH(VLOOKUP($A111,'GPIO Configuration'!$B$4:$P$97,15,FALSE),INDIRECT($A111&\"_OutDrv\"),0)-1)","v":0}]
["P3_15",3,15,"0x006F","GPIO_PODR3_POD15","GPIO_PIDR3_PID15",{"$f":"IF(ISNA(VLOOKUP($A112,'GPIO Configuration'!$B$4:$C$97,2,FALSE)),0,1)","v":0},{"$f":"IF(ISNA(VLOOKUP($A112,'GPIO Configuration'!$B$4:$C$97,2,FALSE)),0,IF(VLOOKUP($A112,'GPIO Configuration'!$B$4:$C$97,2,FALSE)=\"是\",1,0))","v":0},{"$f":"IF(ISNA(VLOOKUP($A112,'GPIO Configuration'!$B$4:$D$97,3,FALSE)),\"\",TRIM(VLOOKUP($A112,'GPIO Configuration'!$B$4:$D$97,3,FALSE)))","v":""},{"$f":"IF(ISNA(VLOOKUP($A112,'GPIO Configuration'!$B$4:$E$97,4,FALSE)),0,IF(VLOOKUP($A112,'GPIO Configuration'!$B$4:$E$97,4,FALSE)=\"OUT - 输出\",1,0))","v":0},{"$f":"IF(ISNA(VLOOKUP($A112,'GPIO Configuration'!$B$4:$F$97,5,FALSE)),0,IF(VLOOKUP($A112,'GPIO Configuration'!$B$4:$F$97,5,FALSE)=\"1 - 高电平\",1,0))","v":0},{"$f":"IF(ISNA(VLOOKUP($A112,'GPIO Configuration'!$B$4:$K$97,10,FALSE)),0,IF(VLOOKUP($A112,'GPIO Configuration'!$B$4:$K$97,10,FALSE)=\"1 - 使能\",1,0))","v":0},{"$f":"IF(ISNA(VLOOKUP($A112,'GPIO Configuration'!$B$4:$J$97,9,FALSE)),0,MATCH(VLOOKUP($A112,'GPIO Configuration'!$B$4:$J$97,9,FALSE),INDIRECT($A112&\"_InLv\"),0)-1)","v":0},{"$f":"IF(ISNA(VLOOKUP($A112,'GPIO Configuration'!$B$4:$L$97,11,FALSE)),0,IF(VLOOKUP($A112,'GPIO Configuration'!$B$4:$L$97,11,FALSE)=\"1 - 使能\",1,0))","v":0},{"$f":"IF(ISNA(VLOOKUP($A112,'GPIO Configuration'!$B$4:$I$97,8,FALSE)),0,IF(VLOOKUP($A112,'GPIO Configuration'!$B$4:$I$97,8,FALSE)=\"上拉\",2,IF(VLOOKUP($A112,'GPIO Configuration'!$B$4:$I$97,8,FALSE)=\"下拉\",1,0)))","v":0},{"$f":"IF(ISNA(VLOOKUP($A112,'GPIO Configuration'!$B$4:$G$97,6,FALSE)),0,MATCH(VLOOKUP($A112,'GPIO Configuration'!$B$4:$G$97,6,FALSE),INDIRECT($A112&\"_Func\"),0)-1)","v":0},{"$f":"IF(ISNA(VLOOKUP($A112,'GPIO Configuration'!$B$4:$H$97,7,FALSE)),0,MATCH(VLOOKUP($A112,'GPIO Configuration'!$B$4:$H$97,7,FALSE),INDIRECT($A112&\"_OutDrv\"),0)-1)","v":0},{"$f":"IF(ISNA(VLOOKUP($A112,'GPIO Configuration'!$B$4:$M$97,12,FALSE)),0,IF(VLOOKUP($A112,'GPIO Configuration'!$B$4:$M$97,12,FALSE)=\"OUT - 输出\",1,0))","v":0},{"$f":"IF(ISNA(VLOOKUP($A112,'GPIO Configuration'!$B$4:$N$97,13,FALSE)),0,IF(VLOOKUP($A112,'GPIO Configuration'!$B$4:$N$97,13,FALSE)=\"1 - 高电平\",1,0))","v":0},{"$f":"IF(ISNA(VLOOKUP($A112,'GPIO Configuration'!$B$4:$S$97,18,FALSE)),0,IF(VLOOKUP($A112,'GPIO Configuration'!$B$4:$S$97,18,FALSE)=\"1 - 使能\",1,0))","v":0},{"$f":"IF(ISNA(VLOOKUP($A112,'GPIO Configuration'!$B$4:$R$97,17,FALSE)),0,MATCH(VLOOKUP($A112,'GPIO Configuration'!$B$4:$R$97,17,FALSE),INDIRECT($A112&\"_InLv\"),0)-1)","v":0},{"$f":"IF(ISNA(VLOOKUP($A112,'GPIO Configuration'!$B$4:$T$97,19,FALSE)),0,IF(VLOOKUP($A112,'GPIO Configuration'!$B$4:$T$97,19,FALSE)=\"1 - 使能\",1,0))","v":0},{"$f":"IF(ISNA(VLOOKUP($A112,'GPIO Configuration'!$B$4:$Q$97,16,FALSE)),0,IF(VLOOKUP($A112,'GPIO Configuration'!$B$4:$Q$97,16,FALSE)=\"上拉\",2,IF(VLOOKUP($A112,'GPIO Configuration'!$B$4:$Q$97,16,FALSE)=\"下拉\",1,0)))","v":0},{"$f":"IF(ISNA(VLOOKUP($A112,'GPIO Configuration'!$B$4:$O$97,14,FALSE)),0,MATCH(VLOOKUP($A112,'GPIO Configuration'!$B$4:$O$97,14,FALSE),INDIRECT($A112&\"_Func\"),0)-1)","v":0},{"$f":"IF(ISNA(VLOOKUP($A112,'GPIO Configuration'!$B$4:$P$97,15,FALSE)),0,MATCH(VLOOKUP($A112,'GPIO Configuration'!$B$4:$P$97,15,FALSE),INDIRECT($A112&\"_OutDrv\"),0)-1)","v":0}]
["P3_16",3,16,"0x0070","GPIO_PODR3_POD16","GPIO_PIDR3_PID16",{"$f":"IF(ISNA(VLOOKUP($A113,'GPIO Configuration'!$B$4:$C$97,2,FALSE)),0,1)","v":0},{"$f":"IF(ISNA(VLOOKUP($A113,'GPIO Configuration'!$B$4:$C$97,2,FALSE)),0,IF(VLOOKUP($A113,'GPIO Configuration'!$B$4:$C$97,2,FALSE)=\"是\",1,0))","v":0},{"$f":"IF(ISNA(VLOOKUP($A113,'GPIO Configuration'!$B$4:$D$97,3,FALSE)),\"\",TRIM(VLOOKUP($A113,'GPIO Configuration'!$B$4:$D$97,3,FALSE)))","v":""},{"$f":"IF(ISNA(VLOOKUP($A113,'GPIO Configuration'!$B$4:$E$97,4,FALSE)),0,IF(VLOOKUP($A113,'GPIO Configuration'!$B$4:$E$97,4,FALSE)=\"OUT - 输出\",1,0))","v":0},{"$f":"IF(ISNA(VLOOKUP($A113,'GPIO Configuration'!$B$4:$F$97,5,FALSE)),0,IF(VLOOKUP($A113,'GPIO Configuration'!$B$4:$F$97,5,FALSE)=\"1 - 高电平\",1,0))","v":0},{"$f":"IF(ISNA(VLOOKUP($A113,'GPIO Configuration'!$B$4:$K$97,10,FALSE)),0,IF(VLOOKUP($A113,'GPIO Configuration'!$B$4:$K$97,10,FALSE)=\"1 - 使能\",1,0))","v":0},{"$f":"IF(ISNA(VLOOKUP($A113,'GPIO Configuration'!$B$4:$J$97,9,FALSE)),0,MATCH(VLOOKUP($A113,'GPIO Configuration'!$B$4:$J$97,9,FALSE),INDIRECT($A113&\"_InLv\"),0)-1)","v":0},{"$f":"IF(ISNA(VLOOKUP($A113,'GPIO Configuration'!$B$4:$L$97,11,FALSE)),0,IF(VLOOKUP($A113,'GPIO Configuration'!$B$4:$L$97,11,FALSE)=\"1 - 使能\",1,0))","v":0},{"$f":"IF(ISNA(VLOOKUP($A113,'GPIO Configuration'!$B$4:$I$97,8,FALSE)),0,IF(VLOOKUP($A113,'GPIO Configuration'!$B$4:$I$97,8,FALSE)=\"上拉\",2,IF(VLOOKUP($A113,'GPIO Configuration'!$B$4:$I$97,8,FALSE)=\"下拉\",1,0)))","v":0},{"$f":"IF(ISNA(VLOOKUP($A113,'GPIO Configuration'!$B$4:$G$97,6,FALSE)),0,MATCH(VLOOKUP($A113,'GPIO Configuration'!$B$4:$G$97,6,FALSE),INDIRECT($A113&\"_Func\"),0)-1)","v":0},{"$f":"IF(ISNA(VLOOKUP($A113,'GPIO Configuration'!$B$4:$H$97,7,FALSE)),0,MATCH(VLOOKUP($A113,'GPIO Configuration'!$B$4:$H$97,7,FALSE),INDIRECT($A113&\"_OutDrv\"),0)-1)","v":0},{"$f":"IF(ISNA(VLOOKUP($A113,'GPIO Configuration'!$B$4:$M$97,12,FALSE)),0,IF(VLOOKUP($A113,'GPIO Configuration'!$B$4:$M$97,12,FALSE)=\"OUT - 输出\",1,0))","v":0},{"$f":"IF(ISNA(VLOOKUP($A113,'GPIO Configuration'!$B$4:$N$97,13,FALSE)),0,IF(VLOOKUP($A113,'GPIO Configuration'!$B$4:$N$97,13,FALSE)=\"1 - 高电平\",1,0))","v":0},{"$f":"IF(ISNA(VLOOKUP($A113,'GPIO Configuration'!$B$4:$S$97,18,FALSE)),0,IF(VLOOKUP($A113,'GPIO Configuration'!$B$4:$S$97,18,FALSE)=\"1 - 使能\",1,0))","v":0},{"$f":"IF(ISNA(VLOOKUP($A113,'GPIO Configuration'!$B$4:$R$97,17,FALSE)),0,MATCH(VLOOKUP($A113,'GPIO Configuration'!$B$4:$R$97,17,FALSE),INDIRECT($A113&\"_InLv\"),0)-1)","v":0},{"$f":"IF(ISNA(VLOOKUP($A113,'GPIO Configuration'!$B$4:$T$97,19,FALSE)),0,IF(VLOOKUP($A113,'GPIO Configuration'!$B$4:$T$97,19,FALSE)=\"1 - 使能\",1,0))","v":0},{"$f":"IF(ISNA(VLOOKUP($A113,'GPIO Configuration'!$B$4:$Q$97,16,FALSE)),0,IF(VLOOKUP($A113,'GPIO Configuration'!$B$4:$Q$97,16,FALSE)=\"上拉\",2,IF(VLOOKUP($A113,'GPIO Configuration'!$B$4:$Q$97,16,FALSE)=\"下拉\",1,0)))","v":0},{"$f":"IF(ISNA(VLOOKUP($A113,'GPIO Configuration'!$B$4:$O$97,14,FALSE)),0,MATCH(VLOOKUP($A113,'GPIO Configuration'!$B$4:$O$97,14,FALSE),INDIRECT($A113&\"_Func\"),0)-1)","v":0},{"$f":"IF(ISNA(VLOOKUP($A113,'GPIO Configuration'!$B$4:$P$97,15,FALSE)),0,MATCH(VLOOKUP($A113,'GPIO Configuration'!$B$4:$P$97,15,FALSE),INDIRECT($A113&\"_OutDrv\"),0)-1)","v":0}]
["P3_17",3,17,"0x0071","GPIO_PODR3_POD17","GPIO_PIDR3_PID17",{"$f":"IF(ISNA(VLOOKUP($A114,'GPIO Configuration'!$B$4:$C$97,2,FALSE)),0,1)","v":0},{"$f":"IF(ISNA(VLOOKUP($A114,'GPIO Configuration'!$B$4:$C$97,2,FALSE)),0,IF(VLOOKUP($A114,'GPIO Configuration'!$B$4:$C$97,2,FALSE)=\"是\",1,0))","v":0},{"$f":"IF(ISNA(VLOOKUP($A114,'GPIO Configuration'!$B$4:$D$97,3,FALSE)),\"\",TRIM(VLOOKUP($A114,'GPIO Configuration'!$B$4:$D$97,3,FALSE)))","v":""},{"$f":"IF(ISNA(VLOOKUP($A114,'GPIO Configuration'!$B$4:$E$97,4,FALSE)),0,IF(VLOOKUP($A114,'GPIO Configuration'!$B$4:$E$97,4,FALSE)=\"OUT - 输出\",1,0))","v":0},{"$f":"IF(ISNA(VLOOKUP($A114,'GPIO Configuration'!$B$4:$F$97,5,FALSE)),0,IF(VLOOKUP($A114,'GPIO Configuration'!$B$4:$F$97,5,FALSE)=\"1 - 高电平\",1,0))","v":0},{"$f":"IF(ISNA(VLOOKUP($A114,'GPIO Configuration'!$B$4:$K$97,10,FALSE)),0,IF(VLOOKUP($A114,'GPIO Configuration'!$B$4:$K$97,10,FALSE)=\"1 - 使能\",1,0))","v":0},{"$f":"IF(ISNA(VLOOKUP($A114,'GPIO Configuration'!$B$4:$J$97,9,FALSE)),0,MATCH(VLOOKUP($A114,'GPIO Configuration'!$B$4:$J$97,9,FALSE),INDIRECT($A114&\"_InLv\"),0)-1)","v":0},{"$f":"IF(ISNA(VLOOKUP($A114,'GPIO Configuration'!$B$4:$L$97,11,FALSE)),0,IF(VLOOKUP($A114,'GPIO Configuration'!$B$4:$L$97,11,FALSE)=\"1 - 使能\",1,0))","v":0},{"$f":"IF(ISNA(VLOOKUP($A114,'GPIO Configuration'!$B$4:$I$97,8,FALSE)),0,IF(VLOOKUP($A114,'GPIO Configuration'!$B$4:$I$97,8,FALSE)=\"上拉\",2,IF(VLOOKUP($A114,'GPIO Configuration'!$B$4:$I$97,8,FALSE)=\"下拉\",1,0)))","v":0},{"$f":"IF(ISNA(VLOOKUP($A114,'GPIO Configuration'!$B$4:$G$97,6,FALSE)),0,MATCH(VLOOKUP($A114,'GPIO Configuration'!$B$4:$G$97,6,FALSE),INDIRECT($A114&\"_Func\"),0)-1)","v":0},{"$f":"IF(ISNA(VLOOKUP($A114,'GPIO Configuration'!$B$4:$H$97,7,FALSE)),0,MATCH(VLOOKUP($A114,'GPIO Configuration'!$B$4:$H$97,7,FALSE),INDIRECT($A114&\"_OutDrv\"),0)-1)","v":0},{"$f":"IF(ISNA(VLOOKUP($A114,'GPIO Configuration'!$B$4:$M$97,12,FALSE)),0,IF(VLOOKUP($A114,'GPIO Configuration'!$B$4:$M$97,12,FALSE)=\"OUT - 输出\",1,0))","v":0},{"$f":"IF(ISNA(VLOOKUP($A114,'GPIO Configuration'!$B$4:$N$97,13,FALSE)),0,IF(VLOOKUP($A114,'GPIO Configuration'!$B$4:$N$97,13,FALSE)=\"1 - 高电平\",1,0))","v":0},{"$f":"IF(ISNA(VLOOKUP($A114,'GPIO Configuration'!$B$4:$S$97,18,FALSE)),0,IF(VLOOKUP($A114,'GPIO Configuration'!$B$4:$S$97,18,FALSE)=\"1 - 使能\",1,0))","v":0},{"$f":"IF(ISNA(VLOOKUP($A114,'GPIO Configuration'!$B$4:$R$97,17,FALSE)),0,MATCH(VLOOKUP($A114,'GPIO Configuration'!$B$4:$R$97,17,FALSE),INDIRECT($A114&\"_InLv\"),0)-1)","v":0},{"$f":"IF(ISNA(VLOOKUP($A114,'GPIO Configuration'!$B$4:$T$97,19,FALSE)),0,IF(VLOOKUP($A114,'GPIO Configuration'!$B$4:$T$97,19,FALSE)=\"1 - 使能\",1,0))","v":0},{"$f":"IF(ISNA(VLOOKUP($A114,'GPIO Configuration'!$B$4:$Q$97,16,FALSE)),0,IF(VLOOKUP($A114,'GPIO Configuration'!$B$4:$Q$97,16,FALSE)=\"上拉\",2,IF(VLOOKUP($A114,'GPIO Configuration'!$B$4:$Q$97,16,FALSE)=\"下拉\",1,0)))","v":0},{"$f":"IF(ISNA(VLOOKUP($A114,'GPIO Configuration'!$B$4:$O$97,14,FALSE)),0,MATCH(VLOOKUP($A114,'GPIO Configuration'!$B$4:$O$97,14,FALSE),INDIRECT($A114&\"_Func\"),0)-1)","v":0},{"$f":"IF(ISNA(VLOOKUP($A114,'GPIO Configuration'!$B$4:$P$97,15,FALSE)),0,MATCH(VLOOKUP($A114,'GPIO Configuration'!$B$4:$P$97,15,FALSE),INDIRECT($A114&\"_OutDrv\"),0)-1)","v":0}]
["P3_18",3,18,"0x0072","GPIO_PODR3_POD18","GPIO_PIDR3_PID18",{"$f":"IF(ISNA(VLOOKUP($A115,'GPIO Configuration'!$B$4:$C$97,2,FALSE)),0,1)","v":0},{"$f":"IF(ISNA(VLOOKUP($A115,'GPIO Configuration'!$B$4:$C$97,2,FALSE)),0,IF(VLOOKUP($A115,'GPIO Configuration'!$B$4:$C$97,2,FALSE)=\"是\",1,0))","v":0},{"$f":"IF(ISNA(VLOOKUP($A115,'GPIO Configuration'!$B$4:$D$97,3,FALSE)),\"\",TRIM(VLOOKUP($A115,'GPIO Configuration'!$B$4:$D$97,3,FALSE)))","v":""},{"$f":"IF(ISNA(VLOOKUP($A115,'GPIO Configuration'!$B$4:$E$97,4,FALSE)),0,IF(VLOOKUP($A115,'GPIO Configuration'!$B$4:$E$97,4,FALSE)=\"OUT - 输出\",1,0))","v":0},{"$f":"IF(ISNA(VLOOKUP($A115,'GPIO Configuration'!$B$4:$F$97,5,FALSE)),0,IF(VLOOKUP($A115,'GPIO Configuration'!$B$4:$F$97,5,FALSE)=\"1 - 高电平\",1,0))","v":0},{"$f":"IF(ISNA(VLOOKUP($A115,'GPIO Configuration'!$B$4:$K$97,10,FALSE)),0,IF(VLOOKUP($A115,'GPIO Configuration'!$B$4:$K$97,10,FALSE)=\"1 - 使能\",1,0))","v":0},{"$f":"IF(ISNA(VLOOKUP($A115,'GPIO Configuration'!$B$4:$J$97,9,FALSE)),0,MATCH(VLOOKUP($A115,'GPIO Configuration'!$B$4:$J$97,9,FALSE),INDIRECT($A115&\"_InLv\"),0)-1)","v":0},{"$f":"IF(ISNA(VLOOKUP($A115,'GPIO Configuration'!$B$4:$L$97,11,FALSE)),0,IF(VLOOKUP($A115,'GPIO Configuration'!$B$4:$L$97,11,FALSE)=\"1 - 使能\",1,0))","v":0},{"$f":"IF(ISNA(VLOOKUP($A115,'GPIO Configuration'!$B$4:$I$97,8,FALSE)),0,IF(VLOOKUP($A115,'GPIO Configuration'!$B$4:$I$97,8,FALSE)=\"上拉\",2,IF(VLOOKUP($A115,'GPIO Configuration'!$B$4:$I$97,8,FALSE)=\"下拉\",1,0)))","v":0},{"$f":"IF(ISNA(VLOOKUP($A115,'GPIO Configuration'!$B$4:$G$97,6,FALSE)),0,MATCH(VLOOKUP($A115,'GPIO Configuration'!$B$4:$G$97,6,FALSE),INDIRECT($A115&\"_Func\"),0)-1)","v":0},{"$f":"IF(ISNA(VLOOKUP($A115,'GPIO Configuration'!$B$4:$H$97,7,FALSE)),0,MATCH(VLOOKUP($A115,'GPIO Configuration'!$B$4:$H$97,7,FALSE),INDIRECT($A115&\"_OutDrv\"),0)-1)","v":0},{"$f":"IF(ISNA(VLOOKUP($A115,'GPIO Configuration'!$B$4:$M$97,12,FALSE)),0,IF(VLOOKUP($A115,'GPIO Configuration'!$B$4:$M$97,12,FALSE)=\"OUT - 输出\",1,0))","v":0},{"$f":"IF(ISNA(VLOOKUP($A115,'GPIO Configuration'!$B$4:$N$97,13,FALSE)),0,IF(VLOOKUP($A115,'GPIO Configuration'!$B$4:$N$97,13,FALSE)=\"1 - 高电平\",1,0))","v":0},{"$f":"IF(ISNA(VLOOKUP($A115,'GPIO Configuration'!$B$4:$S$97,18,FALSE)),0,IF(VLOOKUP($A115,'GPIO Configuration'!$B$4:$S$97,18,FALSE)=\"1 - 使能\",1,0))","v":0},{"$f":"IF(ISNA(VLOOKUP($A115,'GPIO Configuration'!$B$4:$R$97,17,FALSE)),0,MATCH(VLOOKUP($A115,'GPIO Configuration'!$B$4:$R$97,17,FALSE),INDIRECT($A115&\"_InLv\"),0)-1)","v":0},{"$f":"IF(ISNA(VLOOKUP($A115,'GPIO Configuration'!$B$4:$T$97,19,FALSE)),0,IF(VLOOKUP($A115,'GPIO Configuration'!$B$4:$T$97,19,FALSE)=\"1 - 使能\",1,0))","v":0},{"$f":"IF(ISNA(VLOOKUP($A115,'GPIO Configuration'!$B$4:$Q$97,16,FALSE)),0,IF(VLOOKUP($A115,'GPIO Configuration'!$B$4:$Q$97,16,FALSE)=\"上拉\",2,IF(VLOOKUP($A115,'GPIO Configuration'!$B$4:$Q$97,16,FALSE)=\"下拉\",1,0)))","v":0},{"$f":"IF(ISNA(VLOOKUP($A115,'GPIO Configuration'!$B$4:$O$97,14,FALSE)),0,MATCH(VLOOKUP($A115,'GPIO Configuration'!$B$4:$O$97,14,FALSE),INDIRECT($A115&\"_Func\"),0)-1)","v":0},{"$f":"IF(ISNA(VLOOKUP($A115,'GPIO Configuration'!$B$4:$P$97,15,FALSE)),0,MATCH(VLOOKUP($A115,'GPIO Configuration'!$B$4:$P$97,15,FALSE),INDIRECT($A115&\"_OutDrv\"),0)-1)","v":0}]
["P3_19",3,19,"0x0073","GPIO_PODR3_POD19","GPIO_PIDR3_PID19",{"$f":"IF(ISNA(VLOOKUP($A116,'GPIO Configuration'!$B$4:$C$97,2,FALSE)),0,1)","v":0},{"$f":"IF(ISNA(VLOOKUP($A116,'GPIO Configuration'!$B$4:$C$97,2,FALSE)),0,IF(VLOOKUP($A116,'GPIO Configuration'!$B$4:$C$97,2,FALSE)=\"是\",1,0))","v":0},{"$f":"IF(ISNA(VLOOKUP($A116,'GPIO Configuration'!$B$4:$D$97,3,FALSE)),\"\",TRIM(VLOOKUP($A116,'GPIO Configuration'!$B$4:$D$97,3,FALSE)))","v":""},{"$f":"IF(ISNA(VLOOKUP($A116,'GPIO Configuration'!$B$4:$E$97,4,FALSE)),0,IF(VLOOKUP($A116,'GPIO Configuration'!$B$4:$E$97,4,FALSE)=\"OUT - 输出\",1,0))","v":0},{"$f":"IF(ISNA(VLOOKUP($A116,'GPIO Configuration'!$B$4:$F$97,5,FALSE)),0,IF(VLOOKUP($A116,'GPIO Configuration'!$B$4:$F$97,5,FALSE)=\"1 - 高电平\",1,0))","v":0},{"$f":"IF(ISNA(VLOOKUP($A116,'GPIO Configuration'!$B$4:$K$97,10,FALSE)),0,IF(VLOOKUP($A116,'GPIO Configuration'!$B$4:$K$97,10,FALSE)=\"1 - 使能\",1,0))","v":0},{"$f":"IF(ISNA(VLOOKUP($A116,'GPIO Configuration'!$B$4:$J$97,9,FALSE)),0,MATCH(VLOOKUP($A116,'GPIO Configuration'!$B$4:$J$97,9,FALSE),INDIRECT($A116&\"_InLv\"),0)-1)","v":0},{"$f":"IF(ISNA(VLOOKUP($A116,'GPIO Configuration'!$B$4:$L$97,11,FALSE)),0,IF(VLOOKUP($A116,'GPIO Configuration'!$B$4:$L$97,11,FALSE)=\"1 - 使能\",1,0))","v":0},{"$f":"IF(ISNA(VLOOKUP($A116,'GPIO Configuration'!$B$4:$I$97,8,FALSE)),0,IF(VLOOKUP($A116,'GPIO Configuration'!$B$4:$I$97,8,FALSE)=\"上拉\",2,IF(VLOOKUP($A116,'GPIO Configuration'!$B$4:$I$97,8,FALSE)=\"下拉\",1,0)))","v":0},{"$f":"IF(ISNA(VLOOKUP($A116,'GPIO Configuration'!$B$4:$G$97,6,FALSE)),0,MATCH(VLOOKUP($A116,'GPIO Configuration'!$B$4:$G$97,6,FALSE),INDIRECT($A116&\"_Func\"),0)-1)","v":0},{"$f":"IF(ISNA(VLOOKUP($A116,'GPIO Configuration'!$B$4:$H$97,7,FALSE)),0,MATCH(VLOOKUP($A116,'GPIO Configuration'!$B$4:$H$97,7,FALSE),INDIRECT($A116&\"_OutDrv\"),0)-1)","v":0},{"$f":"IF(ISNA(VLOOKUP($A116,'GPIO Configuration'!$B$4:$M$97,12,FALSE)),0,IF(VLOOKUP($A116,'GPIO Configuration'!$B$4:$M$97,12,FALSE)=\"OUT - 输出\",1,0))","v":0},{"$f":"IF(ISNA(VLOOKUP($A116,'GPIO Configuration'!$B$4:$N$97,13,FALSE)),0,IF(VLOOKUP($A116,'GPIO Configuration'!$B$4:$N$97,13,FALSE)=\"1 - 高电平\",1,0))","v":0},{"$f":"IF(ISNA(VLOOKUP($A116,'GPIO Configuration'!$B$4:$S$97,18,FALSE)),0,IF(VLOOKUP($A116,'GPIO Configuration'!$B$4:$S$97,18,FALSE)=\"1 - 使能\",1,0))","v":0},{"$f":"IF(ISNA(VLOOKUP($A116,'GPIO Configuration'!$B$4:$R$97,17,FALSE)),0,MATCH(VLOOKUP($A116,'GPIO Configuration'!$B$4:$R$97,17,FALSE),INDIRECT($A116&\"_InLv\"),0)-1)","v":0},{"$f":"IF(ISNA(VLOOKUP($A116,'GPIO Configuration'!$B$4:$T$97,19,FALSE)),0,IF(VLOOKUP($A116,'GPIO Configuration'!$B$4:$T$97,19,FALSE)=\"1 - 使能\",1,0))","v":0},{"$f":"IF(ISNA(VLOOKUP($A116,'GPIO Configuration'!$B$4:$Q$97,16,FALSE)),0,IF(VLOOKUP($A116,'GPIO Configuration'!$B$4:$Q$97,16,FALSE)=\"上拉\",2,IF(VLOOKUP($A116,'GPIO Configuration'!$B$4:$Q$97,16,FALSE)=\"下拉\",1,0)))","v":0},{"$f":"IF(ISNA(VLOOKUP($A116,'GPIO Configuration'!$B$4:$O$97,14,FALSE)),0,MATCH(VLOOKUP($A116,'GPIO Configuration'!$B$4:$O$97,14,FALSE),INDIRECT($A116&\"_Func\"),0)-1)","v":0},{"$f":"IF(ISNA(VLOOKUP($A116,'GPIO Configuration'!$B$4:$P$97,15,FALSE)),0,MATCH(VLOOKUP($A116,'GPIO Configuration'!$B$4:$P$97,15,FALSE),INDIRECT($A116&\"_OutDrv\"),0)-1)","v":0}]
["P3_20",3,20,"0x0074","GPIO_PODR3_POD20","GPIO_PIDR3_PID20",{"$f":"IF(ISNA(VLOOKUP($A117,'GPIO Configuration'!$B$4:$C$97,2,FALSE)),0,1)","v":0},{"$f":"IF(ISNA(VLOOKUP($A117,'GPIO Configuration'!$B$4:$C$97,2,FALSE)),0,IF(VLOOKUP($A117,'GPIO Configuration'!$B$4:$C$97,2,FALSE)=\"是\",1,0))","v":0},{"$f":"IF(ISNA(VLOOKUP($A117,'GPIO Configuration'!$B$4:$D$97,3,FALSE)),\"\",TRIM(VLOOKUP($A117,'GPIO Configuration'!$B$4:$D$97,3,FALSE)))","v":""},{"$f":"IF(ISNA(VLOOKUP($A117,'GPIO Configuration'!$B$4:$E$97,4,FALSE)),0,IF(VLOOKUP($A117,'GPIO Configuration'!$B$4:$E$97,4,FALSE)=\"OUT - 输出\",1,0))","v":0},{"$f":"IF(ISNA(VLOOKUP($A117,'GPIO Configuration'!$B$4:$F$97,5,FALSE)),0,IF(VLOOKUP($A117,'GPIO Configuration'!$B$4:$F$97,5,FALSE)=\"1 - 高电平\",1,0))","v":0},{"$f":"IF(ISNA(VLOOKUP($A117,'GPIO Configuration'!$B$4:$K$97,10,FALSE)),0,IF(VLOOKUP($A117,'GPIO Configuration'!$B$4:$K$97,10,FALSE)=\"1 - 使能\",1,0))","v":0},{"$f":"IF(ISNA(VLOOKUP($A117,'GPIO Configuration'!$B$4:$J$97,9,FALSE)),0,MATCH(VLOOKUP($A117,'GPIO Configuration'!$B$4:$J$97,9,FALSE),INDIRECT($A117&\"_InLv\"),0)-1)","v":0},{"$f":"IF(ISNA(VLOOKUP($A117,'GPIO Configuration'!$B$4:$L$97,11,FALSE)),0,IF(VLOOKUP($A117,'GPIO Configuration'!$B$4:$L$97,11,FALSE)=\"1 - 使能\",1,0))","v":0},{"$f":"IF(ISNA(VLOOKUP($A117,'GPIO Configuration'!$B$4:$I$97,8,FALSE)),0,IF(VLOOKUP($A117,'GPIO Configuration'!$B$4:$I$97,8,FALSE)=\"上拉\",2,IF(VLOOKUP($A117,'GPIO Configuration'!$B$4:$I$97,8,FALSE)=\"下拉\",1,0)))","v":0},{"$f":"IF(ISNA(VLOOKUP($A117,'GPIO Configuration'!$B$4:$G$97,6,FALSE)),0,MATCH(VLOOKUP($A117,'GPIO Configuration'!$B$4:$G$97,6,FALSE),INDIRECT($A117&\"_Func\"),0)-1)","v":0},{"$f":"IF(ISNA(VLOOKUP($A117,'GPIO Configuration'!$B$4:$H$97,7,FALSE)),0,MATCH(VLOOKUP($A117,'GPIO Configuration'!$B$4:$H$97,7,FALSE),INDIRECT($A117&\"_OutDrv\"),0)-1)","v":0},{"$f":"IF(ISNA(VLOOKUP($A117,'GPIO Configuration'!$B$4:$M$97,12,FALSE)),0,IF(VLOOKUP($A117,'GPIO Configuration'!$B$4:$M$97,12,FALSE)=\"OUT - 输出\",1,0))","v":0},{"$f":"IF(ISNA(VLOOKUP($A117,'GPIO Configuration'!$B$4:$N$97,13,FALSE)),0,IF(VLOOKUP($A117,'GPIO Configuration'!$B$4:$N$97,13,FALSE)=\"1 - 高电平\",1,0))","v":0},{"$f":"IF(ISNA(VLOOKUP($A117,'GPIO Configuration'!$B$4:$S$97,18,FALSE)),0,IF(VLOOKUP($A117,'GPIO Configuration'!$B$4:$S$97,18,FALSE)=\"1 - 使能\",1,0))","v":0},{"$f":"IF(ISNA(VLOOKUP($A117,'GPIO Configuration'!$B$4:$R$97,17,FALSE)),0,MATCH(VLOOKUP($A117,'GPIO Configuration'!$B$4:$R$97,17,FALSE),INDIRECT($A117&\"_InLv\"),0)-1)","v":0},{"$f":"IF(ISNA(VLOOKUP($A117,'GPIO Configuration'!$B$4:$T$97,19,FALSE)),0,IF(VLOOKUP($A117,'GPIO Configuration'!$B$4:$T$97,19,FALSE)=\"1 - 使能\",1,0))","v":0},{"$f":"IF(ISNA(VLOOKUP($A117,'GPIO Configuration'!$B$4:$Q$97,16,FALSE)),0,IF(VLOOKUP($A117,'GPIO Configuration'!$B$4:$Q$97,16,FALSE)=\"上拉\",2,IF(VLOOKUP($A117,'GPIO Configuration'!$B$4:$Q$97,16,FALSE)=\"下拉\",1,0)))","v":0},{"$f":"IF(ISNA(VLOOKUP($A117,'GPIO Configuration'!$B$4:$O$97,14,FALSE)),0,MATCH(VLOOKUP($A117,'GPIO Configuration'!$B$4:$O$97,14,FALSE),INDIRECT($A117&\"_Func\"),0)-1)","v":0},{"$f":"IF(ISNA(VLOOKUP($A117,'GPIO Configuration'!$B$4:$P$97,15,FALSE)),0,MATCH(VLOOKUP($A117,'GPIO Configuration'!$B$4:$P$97,15,FALSE),INDIRECT($A117&\"_OutDrv\"),0)-1)","v":0}]
["P3_21",3,21,"0x0075","GPIO_PODR3_POD21","GPIO_PIDR3_PID21",{"$f":"IF(ISNA(VLOOKUP($A118,'GPIO Configuration'!$B$4:$C$97,2,FALSE)),0,1)","v":0},{"$f":"IF(ISNA(VLOOKUP($A118,'GPIO Configuration'!$B$4:$C$97,2,FALSE)),0,IF(VLOOKUP($A118,'GPIO Configuration'!$B$4:$C$97,2,FALSE)=\"是\",1,0))","v":0},{"$f":"IF(ISNA(VLOOKUP($A118,'GPIO Configuration'!$B$4:$D$97,3,FALSE)),\"\",TRIM(VLOOKUP($A118,'GPIO Configuration'!$B$4:$D$97,3,FALSE)))","v":""},{"$f":"IF(ISNA(VLOOKUP($A118,'GPIO Configuration'!$B$4:$E$97,4,FALSE)),0,IF(VLOOKUP($A118,'GPIO Configuration'!$B$4:$E$97,4,FALSE)=\"OUT - 输出\",1,0))","v":0},{"$f":"IF(ISNA(VLOOKUP($A118,'GPIO Configuration'!$B$4:$F$97,5,FALSE)),0,IF(VLOOKUP($A118,'GPIO Configuration'!$B$4:$F$97,5,FALSE)=\"1 - 高电平\",1,0))","v":0},{"$f":"IF(ISNA(VLOOKUP($A118,'GPIO Configuration'!$B$4:$K$97,10,FALSE)),0,IF(VLOOKUP($A118,'GPIO Configuration'!$B$4:$K$97,10,FALSE)=\"1 - 使能\",1,0))","v":0},{"$f":"IF(ISNA(VLOOKUP($A118,'GPIO Configuration'!$B$4:$J$97,9,FALSE)),0,MATCH(VLOOKUP($A118,'GPIO Configuration'!$B$4:$J$97,9,FALSE),INDIRECT($A118&\"_InLv\"),0)-1)","v":0},{"$f":"IF(ISNA(VLOOKUP($A118,'GPIO Configuration'!$B$4:$L$97,11,FALSE)),0,IF(VLOOKUP($A118,'GPIO Configuration'!$B$4:$L$97,11,FALSE)=\"1 - 使能\",1,0))","v":0},{"$f":"IF(ISNA(VLOOKUP($A118,'GPIO Configuration'!$B$4:$I$97,8,FALSE)),0,IF(VLOOKUP($A118,'GPIO Configuration'!$B$4:$I$97,8,FALSE)=\"上拉\",2,IF(VLOOKUP($A118,'GPIO Configuration'!$B$4:$I$97,8,FALSE)=\"下拉\",1,0)))","v":0},{"$f":"IF(ISNA(VLOOKUP($A118,'GPIO Configuration'!$B$4:$G$97,6,FALSE)),0,MATCH(VLOOKUP($A118,'GPIO Configuration'!$B$4:$G$97,6,FALSE),INDIRECT($A118&\"_Func\"),0)-1)","v":0},{"$f":"IF(ISNA(VLOOKUP($A118,'GPIO Configuration'!$B$4:$H$97,7,FALSE)),0,MATCH(VLOOKUP($A118,'GPIO Configuration'!$B$4:$H$97,7,FALSE),INDIRECT($A118&\"_OutDrv\"),0)-1)","v":0},{"$f":"IF(ISNA(VLOOKUP($A118,'GPIO Configuration'!$B$4:$M$97,12,FALSE)),0,IF(VLOOKUP($A118,'GPIO Configuration'!$B$4:$M$97,12,FALSE)=\"OUT - 输出\",1,0))","v":0},{"$f":"IF(ISNA(VLOOKUP($A118,'GPIO Configuration'!$B$4:$N$97,13,FALSE)),0,IF(VLOOKUP($A118,'GPIO Configuration'!$B$4:$N$97,13,FALSE)=\"1 - 高电平\",1,0))","v":0},{"$f":"IF(ISNA(VLOOKUP($A118,'GPIO Configuration'!$B$4:$S$97,18,FALSE)),0,IF(VLOOKUP($A118,'GPIO Configuration'!$B$4:$S$97,18,FALSE)=\"1 - 使能\",1,0))","v":0},{"$f":"IF(ISNA(VLOOKUP($A118,'GPIO Configuration'!$B$4:$R$97,17,FALSE)),0,MATCH(VLOOKUP($A118,'GPIO Configuration'!$B$4:$R$97,17,FALSE),INDIRECT($A118&\"_InLv\"),0)-1)","v":0},{"$f":"IF(ISNA(VLOOKUP($A118,'GPIO Configuration'!$B$4:$T$97,19,FALSE)),0,IF(VLOOKUP($A118,'GPIO Configuration'!$B$4:$T$97,19,FALSE)=\"1 - 使能\",1,0))","v":0},{"$f":"IF(ISNA(VLOOKUP($A118,'GPIO Configuration'!$B$4:$Q$97,16,FALSE)),0,IF(VLOOKUP($A118,'GPIO Configuration'!$B$4:$Q$97,16,FALSE)=\"上拉\",2,IF(VLOOKUP($A118,'GPIO Configuration'!$B$4:$Q$97,16,FALSE)=\"下拉\",1,0)))","v":0},{"$f":"IF(ISNA(VLOOKUP($A118,'GPIO Configuration'!$B$4:$O$97,14,FALSE)),0,MATCH(VLOOKUP($A118,'GPIO Configuration'!$B$4:$O$97,14,FALSE),INDIRECT($A118&\"_Func\"),0)-1)","v":0},{"$f":"IF(ISNA(VLOOKUP($A118,'GPIO Configuration'!$B$4:$P$97,15,FALSE)),0,MATCH(VLOOKUP($A118,'GPIO Configuration'!$B$4:$P$97,15,FALSE),INDIRECT($A118&\"_OutDrv\"),0)-1)","v":0}]
["P3_22",3,22,"0x0076","GPIO_PODR3_POD22","GPIO_PIDR3_PID22",{"$f":"IF(ISNA(VLOOKUP($A119,'GPIO Configuration'!$B$4:$C$97,2,FALSE)),0,1)","v":0},{"$f":"IF(ISNA(VLOOKUP($A119,'GPIO Configuration'!$B$4:$C$97,2,FALSE)),0,IF(VLOOKUP($A119,'GPIO Configuration'!$B$4:$C$97,2,FALSE)=\"是\",1,0))","v":0},{"$f":"IF(ISNA(VLOOKUP($A119,'GPIO Configuration'!$B$4:$D$97,3,FALSE)),\"\",TRIM(VLOOKUP($A119,'GPIO Configuration'!$B$4:$D$97,3,FALSE)))","v":""},{"$f":"IF(ISNA(VLOOKUP($A119,'GPIO Configuration'!$B$4:$E$97,4,FALSE)),0,IF(VLOOKUP($A119,'GPIO Configuration'!$B$4:$E$97,4,FALSE)=\"OUT - 输出\",1,0))","v":0},{"$f":"IF(ISNA(VLOOKUP($A119,'GPIO Configuration'!$B$4:$F$97,5,FALSE)),0,IF(VLOOKUP($A119,'GPIO Configuration'!$B$4:$F$97,5,FALSE)=\"1 - 高电平\",1,0))","v":0},{"$f":"IF(ISNA(VLOOKUP($A119,'GPIO Configuration'!$B$4:$K$97,10,FALSE)),0,IF(VLOOKUP($A119,'GPIO Configuration'!$B$4:$K$97,10,FALSE)=\"1 - 使能\",1,0))","v":0},{"$f":"IF(ISNA(VLOOKUP($A119,'GPIO Configuration'!$B$4:$J$97,9,FALSE)),0,MATCH(VLOOKUP($A119,'GPIO Configuration'!$B$4:$J$97,9,FALSE),INDIRECT($A119&\"_InLv\"),0)-1)","v":0},{"$f":"IF(ISNA(VLOOKUP($A119,'GPIO Configuration'!$B$4:$L$97,11,FALSE)),0,IF(VLOOKUP($A119,'GPIO Configuration'!$B$4:$L$97,11,FALSE)=\"1 - 使能\",1,0))","v":0},{"$f":"IF(ISNA(VLOOKUP($A119,'GPIO Configuration'!$B$4:$I$97,8,FALSE)),0,IF(VLOOKUP($A119,'GPIO Configuration'!$B$4:$I$97,8,FALSE)=\"上拉\",2,IF(VLOOKUP($A119,'GPIO Configuration'!$B$4:$I$97,8,FALSE)=\"下拉\",1,0)))","v":0},{"$f":"IF(ISNA(VLOOKUP($A119,'GPIO Configuration'!$B$4:$G$97,6,FALSE)),0,MATCH(VLOOKUP($A119,'GPIO Configuration'!$B$4:$G$97,6,FALSE),INDIRECT($A119&\"_Func\"),0)-1)","v":0},{"$f":"IF(ISNA(VLOOKUP($A119,'GPIO Configuration'!$B$4:$H$97,7,FALSE)),0,MATCH(VLOOKUP($A119,'GPIO Configuration'!$B$4:$H$97,7,FALSE),INDIRECT($A119&\"_OutDrv\"),0)-1)","v":0},{"$f":"IF(ISNA(VLOOKUP($A119,'GPIO Configuration'!$B$4:$M$97,12,FALSE)),0,IF(VLOOKUP($A119,'GPIO Configuration'!$B$4:$M$97,12,FALSE)=\"OUT - 输出\",1,0))","v":0},{"$f":"IF(ISNA(VLOOKUP($A119,'GPIO Configuration'!$B$4:$N$97,13,FALSE)),0,IF(VLOOKUP($A119,'GPIO Configuration'!$B$4:$N$97,13,FALSE)=\"1 - 高电平\",1,0))","v":0},{"$f":"IF(ISNA(VLOOKUP($A119,'GPIO Configuration'!$B$4:$S$97,18,FALSE)),0,IF(VLOOKUP($A119,'GPIO Configuration'!$B$4:$S$97,18,FALSE)=\"1 - 使能\",1,0))","v":0},{"$f":"IF(ISNA(VLOOKUP($A119,'GPIO Configuration'!$B$4:$R$97,17,FALSE)),0,MATCH(VLOOKUP($A119,'GPIO Configuration'!$B$4:$R$97,17,FALSE),INDIRECT($A119&\"_InLv\"),0)-1)","v":0},{"$f":"IF(ISNA(VLOOKUP($A119,'GPIO Configuration'!$B$4:$T$97,19,FALSE)),0,IF(VLOOKUP($A119,'GPIO Configuration'!$B$4:$T$97,19,FALSE)=\"1 - 使能\",1,0))","v":0},{"$f":"IF(ISNA(VLOOKUP($A119,'GPIO Configuration'!$B$4:$Q$97,16,FALSE)),0,IF(VLOOKUP($A119,'GPIO Configuration'!$B$4:$Q$97,16,FALSE)=\"上拉\",2,IF(VLOOKUP($A119,'GPIO Configuration'!$B$4:$Q$97,16,FALSE)=\"下拉\",1,0)))","v":0},{"$f":"IF(ISNA(VLOOKUP($A119,'GPIO Configuration'!$B$4:$O$97,14,FALSE)),0,MATCH(VLOOKUP($A119,'GPIO Configuration'!$B$4:$O$97,14,FALSE),INDIRECT($A119&\"_Func\"),0)-1)","v":0},{"$f":"IF(ISNA(VLOOKUP($A119,'GPIO Configuration'!$B$4:$P$97,15,FALSE)),0,MATCH(VLOOKUP($A119,'GPIO Configuration'!$B$4:$P$97,15,FALSE),INDIRECT($A119&\"_OutDrv\"),0)-1)","v":0}]
["P3_23",3,23,"0x0077","GPIO_PODR3_POD23","GPIO_PIDR3_PID23",{"$f":"IF(ISNA(VLOOKUP($A120,'GPIO Configuration'!$B$4:$C$97,2,FALSE)),0,1)","v":0},{"$f":"IF(ISNA(VLOOKUP($A120,'GPIO Configuration'!$B$4:$C$97,2,FALSE)),0,IF(VLOOKUP($A120,'GPIO Configuration'!$B$4:$C$97,2,FALSE)=\"是\",1,0))","v":0},{"$f":"IF(ISNA(VLOOKUP($A120,'GPIO Configuration'!$B$4:$D$97,3,FALSE)),\"\",TRIM(VLOOKUP($A120,'GPIO Configuration'!$B$4:$D$97,3,FALSE)))","v":""},{"$f":"IF(ISNA(VLOOKUP($A120,'GPIO Configuration'!$B$4:$E$97,4,FALSE)),0,IF(VLOOKUP($A120,'GPIO Configuration'!$B$4:$E$97,4,FALSE)=\"OUT - 输出\",1,0))","v":0},{"$f":"IF(ISNA(VLOOKUP($A120,'GPIO Configuration'!$B$4:$F$97,5,FALSE)),0,IF(VLOOKUP($A120,'GPIO Configuration'!$B$4:$F$97,5,FALSE)=\"1 - 高电平\",1,0))","v":0},{"$f":"IF(ISNA(VLOOKUP($A120,'GPIO Configuration'!$B$4:$K$97,10,FALSE)),0,IF(VLOOKUP($A120,'GPIO Configuration'!$B$4:$K$97,10,FALSE)=\"1 - 使能\",1,0))","v":0},{"$f":"IF(ISNA(VLOOKUP($A120,'GPIO Configuration'!$B$4:$J$97,9,FALSE)),0,MATCH(VLOOKUP($A120,'GPIO Configuration'!$B$4:$J$97,9,FALSE),INDIRECT($A120&\"_InLv\"),0)-1)","v":0},{"$f":"IF(ISNA(VLOOKUP($A120,'GPIO Configuration'!$B$4:$L$97,11,FALSE)),0,IF(VLOOKUP($A120,'GPIO Configuration'!$B$4:$L$97,11,FALSE)=\"1 - 使能\",1,0))","v":0},{"$f":"IF(ISNA(VLOOKUP($A120,'GPIO Configuration'!$B$4:$I$97,8,FALSE)),0,IF(VLOOKUP($A120,'GPIO Configuration'!$B$4:$I$97,8,FALSE)=\"上拉\",2,IF(VLOOKUP($A120,'GPIO Configuration'!$B$4:$I$97,8,FALSE)=\"下拉\",1,0)))","v":0},{"$f":"IF(ISNA(VLOOKUP($A120,'GPIO Configuration'!$B$4:$G$97,6,FALSE)),0,MATCH(VLOOKUP($A120,'GPIO Configuration'!$B$4:$G$97,6,FALSE),INDIRECT($A120&\"_Func\"),0)-1)","v":0},{"$f":"IF(ISNA(VLOOKUP($A120,'GPIO Configuration'!$B$4:$H$97,7,FALSE)),0,MATCH(VLOOKUP($A120,'GPIO Configuration'!$B$4:$H$97,7,FALSE),INDIRECT($A120&\"_OutDrv\"),0)-1)","v":0},{"$f":"IF(ISNA(VLOOKUP($A120,'GPIO Configuration'!$B$4:$M$97,12,FALSE)),0,IF(VLOOKUP($A120,'GPIO Configuration'!$B$4:$M$97,12,FALSE)=\"OUT - 输出\",1,0))","v":0},{"$f":"IF(ISNA(VLOOKUP($A120,'GPIO Configuration'!$B$4:$N$97,13,FALSE)),0,IF(VLOOKUP($A120,'GPIO Configuration'!$B$4:$N$97,13,FALSE)=\"1 - 高电平\",1,0))","v":0},{"$f":"IF(ISNA(VLOOKUP($A120,'GPIO Configuration'!$B$4:$S$97,18,FALSE)),0,IF(VLOOKUP($A120,'GPIO Configuration'!$B$4:$S$97,18,FALSE)=\"1 - 使能\",1,0))","v":0},{"$f":"IF(ISNA(VLOOKUP($A120,'GPIO Configuration'!$B$4:$R$97,17,FALSE)),0,MATCH(VLOOKUP($A120,'GPIO Configuration'!$B$4:$R$97,17,FALSE),INDIRECT($A120&\"_InLv\"),0)-1)","v":0},{"$f":"IF(ISNA(VLOOKUP($A120,'GPIO Configuration'!$B$4:$T$97,19,FALSE)),0,IF(VLOOKUP($A120,'GPIO Configuration'!$B$4:$T$97,19,FALSE)=\"1 - 使能\",1,0))","v":0},{"$f":"IF(ISNA(VLOOKUP($A120,'GPIO Configuration'!$B$4:$Q$97,16,FALSE)),0,IF(VLOOKUP($A120,'GPIO Configuration'!$B$4:$Q$97,16,FALSE)=\"上拉\",2,IF(VLOOKUP($A120,'GPIO Configuration'!$B$4:$Q$97,16,FALSE)=\"下拉\",1,0)))","v":0},{"$f":"IF(ISNA(VLOOKUP($A120,'GPIO Configuration'!$B$4:$O$97,14,FALSE)),0,MATCH(VLOOKUP($A120,'GPIO Configuration'!$B$4:$O$97,14,FALSE),INDIRECT($A120&\"_Func\"),0)-1)","v":0},{"$f":"IF(ISNA(VLOOKUP($A120,'GPIO Configuration'!$B$4:$P$97,15,FALSE)),0,MATCH(VLOOKUP($A120,'GPIO Configuration'!$B$4:$P$97,15,FALSE),INDIRECT($A120&\"_OutDrv\"),0)-1)","v":0}]
["P3_24",3,24,"0x0078","GPIO_PODR3_POD24","GPIO_PIDR3_PID24",{"$f":"IF(ISNA(VLOOKUP($A121,'GPIO Configuration'!$B$4:$C$97,2,FALSE)),0,1)","v":0},{"$f":"IF(ISNA(VLOOKUP($A121,'GPIO Configuration'!$B$4:$C$97,2,FALSE)),0,IF(VLOOKUP($A121,'GPIO Configuration'!$B$4:$C$97,2,FALSE)=\"是\",1,0))","v":0},{"$f":"IF(ISNA(VLOOKUP($A121,'GPIO Configuration'!$B$4:$D$97,3,FALSE)),\"\",TRIM(VLOOKUP($A121,'GPIO Configuration'!$B$4:$D$97,3,FALSE)))","v":""},{"$f":"IF(ISNA(VLOOKUP($A121,'GPIO Configuration'!$B$4:$E$97,4,FALSE)),0,IF(VLOOKUP($A121,'GPIO Configuration'!$B$4:$E$97,4,FALSE)=\"OUT - 输出\",1,0))","v":0},{"$f":"IF(ISNA(VLOOKUP($A121,'GPIO Configuration'!$B$4:$F$97,5,FALSE)),0,IF(VLOOKUP($A121,'GPIO Configuration'!$B$4:$F$97,5,FALSE)=\"1 - 高电平\",1,0))","v":0},{"$f":"IF(ISNA(VLOOKUP($A121,'GPIO Configuration'!$B$4:$K$97,10,FALSE)),0,IF(VLOOKUP($A121,'GPIO Configuration'!$B$4:$K$97,10,FALSE)=\"1 - 使能\",1,0))","v":0},{"$f":"IF(ISNA(VLOOKUP($A121,'GPIO Configuration'!$B$4:$J$97,9,FALSE)),0,MATCH(VLOOKUP($A121,'GPIO Configuration'!$B$4:$J$97,9,FALSE),INDIRECT($A121&\"_InLv\"),0)-1)","v":0},{"$f":"IF(ISNA(VLOOKUP($A121,'GPIO Configuration'!$B$4:$L$97,11,FALSE)),0,IF(VLOOKUP($A121,'GPIO Configuration'!$B$4:$L$97,11,FALSE)=\"1 - 使能\",1,0))","v":0},{"$f":"IF(ISNA(VLOOKUP($A121,'GPIO Configuration'!$B$4:$I$97,8,FALSE)),0,IF(VLOOKUP($A121,'GPIO Configuration'!$B$4:$I$97,8,FALSE)=\"上拉\",2,IF(VLOOKUP($A121,'GPIO Configuration'!$B$4:$I$97,8,FALSE)=\"下拉\",1,0)))","v":0},{"$f":"IF(ISNA(VLOOKUP($A121,'GPIO Configuration'!$B$4:$G$97,6,FALSE)),0,MATCH(VLOOKUP($A121,'GPIO Configuration'!$B$4:$G$97,6,FALSE),INDIRECT($A121&\"_Func\"),0)-1)","v":0},{"$f":"IF(ISNA(VLOOKUP($A121,'GPIO Configuration'!$B$4:$H$97,7,FALSE)),0,MATCH(VLOOKUP($A121,'GPIO Configuration'!$B$4:$H$97,7,FALSE),INDIRECT($A121&\"_OutDrv\"),0)-1)","v":0},{"$f":"IF(ISNA(VLOOKUP($A121,'GPIO Configuration'!$B$4:$M$97,12,FALSE)),0,IF(VLOOKUP($A121,'GPIO Configuration'!$B$4:$M$97,12,FALSE)=\"OUT - 输出\",1,0))","v":0},{"$f":"IF(ISNA(VLOOKUP($A121,'GPIO Configuration'!$B$4:$N$97,13,FALSE)),0,IF(VLOOKUP($A121,'GPIO Configuration'!$B$4:$N$97,13,FALSE)=\"1 - 高电平\",1,0))","v":0},{"$f":"IF(ISNA(VLOOKUP($A121,'GPIO Configuration'!$B$4:$S$97,18,FALSE)),0,IF(VLOOKUP($A121,'GPIO Configuration'!$B$4:$S$97,18,FALSE)=\"1 - 使能\",1,0))","v":0},{"$f":"IF(ISNA(VLOOKUP($A121,'GPIO Configuration'!$B$4:$R$97,17,FALSE)),0,MATCH(VLOOKUP($A121,'GPIO Configuration'!$B$4:$R$97,17,FALSE),INDIRECT($A121&\"_InLv\"),0)-1)","v":0},{"$f":"IF(ISNA(VLOOKUP($A121,'GPIO Configuration'!$B$4:$T$97,19,FALSE)),0,IF(VLOOKUP($A121,'GPIO Configuration'!$B$4:$T$97,19,FALSE)=\"1 - 使能\",1,0))","v":0},{"$f":"IF(ISNA(VLOOKUP($A121,'GPIO Configuration'!$B$4:$Q$97,16,FALSE)),0,IF(VLOOKUP($A121,'GPIO Configuration'!$B$4:$Q$97,16,FALSE)=\"上拉\",2,IF(VLOOKUP($A121,'GPIO Configuration'!$B$4:$Q$97,16,FALSE)=\"下拉\",1,0)))","v":0},{"$f":"IF(ISNA(VLOOKUP($A121,'GPIO Configuration'!$B$4:$O$97,14,FALSE)),0,MATCH(VLOOKUP($A121,'GPIO Configuration'!$B$4:$O$97,14,FALSE),INDIRECT($A121&\"_Func\"),0)-1)","v":0},{"$f":"IF(ISNA(VLOOKUP($A121,'GPIO Configuration'!$B$4:$P$97,15,FALSE)),0,MATCH(VLOOKUP($A121,'GPIO Configuration'!$B$4:$P$97,15,FALSE),INDIRECT($A121&\"_OutDrv\"),0)-1)","v":0}]
["P3_25",3,25,"0x0079","GPIO_PODR3_POD25","GPIO_PIDR3_PID25",{"$f":"IF(ISNA(VLOOKUP($A122,'GPIO Configuration'!$B$4:$C$97,2,FALSE)),0,1)","v":0},{"$f":"IF(ISNA(VLOOKUP($A122,'GPIO Configuration'!$B$4:$C$97,2,FALSE)),0,IF(VLOOKUP($A122,'GPIO Configuration'!$B$4:$C$97,2,FALSE)=\"是\",1,0))","v":0},{"$f":"IF(ISNA(VLOOKUP($A122,'GPIO Configuration'!$B$4:$D$97,3,FALSE)),\"\",TRIM(VLOOKUP($A122,'GPIO Configuration'!$B$4:$D$97,3,FALSE)))","v":""},{"$f":"IF(ISNA(VLOOKUP($A122,'GPIO Configuration'!$B$4:$E$97,4,FALSE)),0,IF(VLOOKUP($A122,'GPIO Configuration'!$B$4:$E$97,4,FALSE)=\"OUT - 输出\",1,0))","v":0},{"$f":"IF(ISNA(VLOOKUP($A122,'GPIO Configuration'!$B$4:$F$97,5,FALSE)),0,IF(VLOOKUP($A122,'GPIO Configuration'!$B$4:$F$97,5,FALSE)=\"1 - 高电平\",1,0))","v":0},{"$f":"IF(ISNA(VLOOKUP($A122,'GPIO Configuration'!$B$4:$K$97,10,FALSE)),0,IF(VLOOKUP($A122,'GPIO Configuration'!$B$4:$K$97,10,FALSE)=\"1 - 使能\",1,0))","v":0},{"$f":"IF(ISNA(VLOOKUP($A122,'GPIO Configuration'!$B$4:$J$97,9,FALSE)),0,MATCH(VLOOKUP($A122,'GPIO Configuration'!$B$4:$J$97,9,FALSE),INDIRECT($A122&\"_InLv\"),0)-1)","v":0},{"$f":"IF(ISNA(VLOOKUP($A122,'GPIO Configuration'!$B$4:$L$97,11,FALSE)),0,IF(VLOOKUP($A122,'GPIO Configuration'!$B$4:$L$97,11,FALSE)=\"1 - 使能\",1,0))","v":0},{"$f":"IF(ISNA(VLOOKUP($A122,'GPIO Configuration'!$B$4:$I$97,8,FALSE)),0,IF(VLOOKUP($A122,'GPIO Configuration'!$B$4:$I$97,8,FALSE)=\"上拉\",2,IF(VLOOKUP($A122,'GPIO Configuration'!$B$4:$I$97,8,FALSE)=\"下拉\",1,0)))","v":0},{"$f":"IF(ISNA(VLOOKUP($A122,'GPIO Configuration'!$B$4:$G$97,6,FALSE)),0,MATCH(VLOOKUP($A122,'GPIO Configuration'!$B$4:$G$97,6,FALSE),INDIRECT($A122&\"_Func\"),0)-1)","v":0},{"$f":"IF(ISNA(VLOOKUP($A122,'GPIO Configuration'!$B$4:$H$97,7,FALSE)),0,MATCH(VLOOKUP($A122,'GPIO Configuration'!$B$4:$H$97,7,FALSE),INDIRECT($A122&\"_OutDrv\"),0)-1)","v":0},{"$f":"IF(ISNA(VLOOKUP($A122,'GPIO Configuration'!$B$4:$M$97,12,FALSE)),0,IF(VLOOKUP($A122,'GPIO Configuration'!$B$4:$M$97,12,FALSE)=\"OUT - 输出\",1,0))","v":0},{"$f":"IF(ISNA(VLOOKUP($A122,'GPIO Configuration'!$B$4:$N$97,13,FALSE)),0,IF(VLOOKUP($A122,'GPIO Configuration'!$B$4:$N$97,13,FALSE)=\"1 - 高电平\",1,0))","v":0},{"$f":"IF(ISNA(VLOOKUP($A122,'GPIO Configuration'!$B$4:$S$97,18,FALSE)),0,IF(VLOOKUP($A122,'GPIO Configuration'!$B$4:$S$97,18,FALSE)=\"1 - 使能\",1,0))","v":0},{"$f":"IF(ISNA(VLOOKUP($A122,'GPIO Configuration'!$B$4:$R$97,17,FALSE)),0,MATCH(VLOOKUP($A122,'GPIO Configuration'!$B$4:$R$97,17,FALSE),INDIRECT($A122&\"_InLv\"),0)-1)","v":0},{"$f":"IF(ISNA(VLOOKUP($A122,'GPIO Configuration'!$B$4:$T$97,19,FALSE)),0,IF(VLOOKUP($A122,'GPIO Configuration'!$B$4:$T$97,19,FALSE)=\"1 - 使能\",1,0))","v":0},{"$f":"IF(ISNA(VLOOKUP($A122,'GPIO Configuration'!$B$4:$Q$97,16,FALSE)),0,IF(VLOOKUP($A122,'GPIO Configuration'!$B$4:$Q$97,16,FALSE)=\"上拉\",2,IF(VLOOKUP($A122,'GPIO Configuration'!$B$4:$Q$97,16,FALSE)=\"下拉\",1,0)))","v":0},{"$f":"IF(ISNA(VLOOKUP($A122,'GPIO Configuration'!$B$4:$O$97,14,FALSE)),0,MATCH(VLOOKUP($A122,'GPIO Configuration'!$B$4:$O$97,14,FALSE),INDIRECT($A122&\"_Func\"),0)-1)","v":0},{"$f":"IF(ISNA(VLOOKUP($A122,'GPIO Configuration'!$B$4:$P$97,15,FALSE)),0,MATCH(VLOOKUP($A122,'GPIO Configuration'!$B$4:$P$97,15,FALSE),INDIRECT($A122&\"_OutDrv\"),0)-1)","v":0}]
["P3_26",3,26,"0x007A","GPIO_PODR3_POD26","GPIO_PIDR3_PID26",{"$f":"IF(ISNA(VLOOKUP($A123,'GPIO Configuration'!$B$4:$C$97,2,FALSE)),0,1)","v":0},{"$f":"IF(ISNA(VLOOKUP($A123,'GPIO Configuration'!$B$4:$C$97,2,FALSE)),0,IF(VLOOKUP($A123,'GPIO Configuration'!$B$4:$C$97,2,FALSE)=\"是\",1,0))","v":0},{"$f":"IF(ISNA(VLOOKUP($A123,'GPIO Configuration'!$B$4:$D$97,3,FALSE)),\"\",TRIM(VLOOKUP($A123,'GPIO Configuration'!$B$4:$D$97,3,FALSE)))","v":""},{"$f":"IF(ISNA(VLOOKUP($A123,'GPIO Configuration'!$B$4:$E$97,4,FALSE)),0,IF(VLOOKUP($A123,'GPIO Configuration'!$B$4:$E$97,4,FALSE)=\"OUT - 输出\",1,0))","v":0},{"$f":"IF(ISNA(VLOOKUP($A123,'GPIO Configuration'!$B$4:$F$97,5,FALSE)),0,IF(VLOOKUP($A123,'GPIO Configuration'!$B$4:$F$97,5,FALSE)=\"1 - 高电平\",1,0))","v":0},{"$f":"IF(ISNA(VLOOKUP($A123,'GPIO Configuration'!$B$4:$K$97,10,FALSE)),0,IF(VLOOKUP($A123,'GPIO Configuration'!$B$4:$K$97,10,FALSE)=\"1 - 使能\",1,0))","v":0},{"$f":"IF(ISNA(VLOOKUP($A123,'GPIO Configuration'!$B$4:$J$97,9,FALSE)),0,MATCH(VLOOKUP($A123,'GPIO Configuration'!$B$4:$J$97,9,FALSE),INDIRECT($A123&\"_InLv\"),0)-1)","v":0},{"$f":"IF(ISNA(VLOOKUP($A123,'GPIO Configuration'!$B$4:$L$97,11,FALSE)),0,IF(VLOOKUP($A123,'GPIO Configuration'!$B$4:$L$97,11,FALSE)=\"1 - 使能\",1,0))","v":0},{"$f":"IF(ISNA(VLOOKUP($A123,'GPIO Configuration'!$B$4:$I$97,8,FALSE)),0,IF(VLOOKUP($A123,'GPIO Configuration'!$B$4:$I$97,8,FALSE)=\"上拉\",2,IF(VLOOKUP($A123,'GPIO Configuration'!$B$4:$I$97,8,FALSE)=\"下拉\",1,0)))","v":0},{"$f":"IF(ISNA(VLOOKUP($A123,'GPIO Configuration'!$B$4:$G$97,6,FALSE)),0,MATCH(VLOOKUP($A123,'GPIO Configuration'!$B$4:$G$97,6,FALSE),INDIRECT($A123&\"_Func\"),0)-1)","v":0},{"$f":"IF(ISNA(VLOOKUP($A123,'GPIO Configuration'!$B$4:$H$97,7,FALSE)),0,MATCH(VLOOKUP($A123,'GPIO Configuration'!$B$4:$H$97,7,FALSE),INDIRECT($A123&\"_OutDrv\"),0)-1)","v":0},{"$f":"IF(ISNA(VLOOKUP($A123,'GPIO Configuration'!$B$4:$M$97,12,FALSE)),0,IF(VLOOKUP($A123,'GPIO Configuration'!$B$4:$M$97,12,FALSE)=\"OUT - 输出\",1,0))","v":0},{"$f":"IF(ISNA(VLOOKUP($A123,'GPIO Configuration'!$B$4:$N$97,13,FALSE)),0,IF(VLOOKUP($A123,'GPIO Configuration'!$B$4:$N$97,13,FALSE)=\"1 - 高电平\",1,0))","v":0},{"$f":"IF(ISNA(VLOOKUP($A123,'GPIO Configuration'!$B$4:$S$97,18,FALSE)),0,IF(VLOOKUP($A123,'GPIO Configuration'!$B$4:$S$97,18,FALSE)=\"1 - 使能\",1,0))","v":0},{"$f":"IF(ISNA(VLOOKUP($A123,'GPIO Configuration'!$B$4:$R$97,17,FALSE)),0,MATCH(VLOOKUP($A123,'GPIO Configuration'!$B$4:$R$97,17,FALSE),INDIRECT($A123&\"_InLv\"),0)-1)","v":0},{"$f":"IF(ISNA(VLOOKUP($A123,'GPIO Configuration'!$B$4:$T$97,19,FALSE)),0,IF(VLOOKUP($A123,'GPIO Configuration'!$B$4:$T$97,19,FALSE)=\"1 - 使能\",1,0))","v":0},{"$f":"IF(ISNA(VLOOKUP($A123,'GPIO Configuration'!$B$4:$Q$97,16,FALSE)),0,IF(VLOOKUP($A123,'GPIO Configuration'!$B$4:$Q$97,16,FALSE)=\"上拉\",2,IF(VLOOKUP($A123,'GPIO Configuration'!$B$4:$Q$97,16,FALSE)=\"下拉\",1,0)))","v":0},{"$f":"IF(ISNA(VLOOKUP($A123,'GPIO Configuration'!$B$4:$O$97,14,FALSE)),0,MATCH(VLOOKUP($A123,'GPIO Configuration'!$B$4:$O$97,14,FALSE),INDIRECT($A123&\"_Func\"),0)-1)","v":0},{"$f":"IF(ISNA(VLOOKUP($A123,'GPIO Configuration'!$B$4:$P$97,15,FALSE)),0,MATCH(VLOOKUP($A123,'GPIO Configuration'!$B$4:$P$97,15,FALSE),INDIRECT($A123&\"_OutDrv\"),0)-1)","v":0}]
["P3_27",3,27,"0x007B","GPIO_PODR3_POD27","GPIO_PIDR3_PID27",{"$f":"IF(ISNA(VLOOKUP($A124,'GPIO Configuration'!$B$4:$C$97,2,FALSE)),0,1)","v":0},{"$f":"IF(ISNA(VLOOKUP($A124,'GPIO Configuration'!$B$4:$C$97,2,FALSE)),0,IF(VLOOKUP($A124,'GPIO Configuration'!$B$4:$C$97,2,FALSE)=\"是\",1,0))","v":0},{"$f":"IF(ISNA(VLOOKUP($A124,'GPIO Configuration'!$B$4:$D$97,3,FALSE)),\"\",TRIM(VLOOKUP($A124,'GPIO Configuration'!$B$4:$D$97,3,FALSE)))","v":""},{"$f":"IF(ISNA(VLOOKUP($A124,'GPIO Configuration'!$B$4:$E$97,4,FALSE)),0,IF(VLOOKUP($A124,'GPIO Configuration'!$B$4:$E$97,4,FALSE)=\"OUT - 输出\",1,0))","v":0},{"$f":"IF(ISNA(VLOOKUP($A124,'GPIO Configuration'!$B$4:$F$97,5,FALSE)),0,IF(VLOOKUP($A124,'GPIO Configuration'!$B$4:$F$97,5,FALSE)=\"1 - 高电平\",1,0))","v":0},{"$f":"IF(ISNA(VLOOKUP($A124,'GPIO Configuration'!$B$4:$K$97,10,FALSE)),0,IF(VLOOKUP($A124,'GPIO Configuration'!$B$4:$K$97,10,FALSE)=\"1 - 使能\",1,0))","v":0},{"$f":"IF(ISNA(VLOOKUP($A124,'GPIO Configuration'!$B$4:$J$97,9,FALSE)),0,MATCH(VLOOKUP($A124,'GPIO Configuration'!$B$4:$J$97,9,FALSE),INDIRECT($A124&\"_InLv\"),0)-1)","v":0},{"$f":"IF(ISNA(VLOOKUP($A124,'GPIO Configuration'!$B$4:$L$97,11,FALSE)),0,IF(VLOOKUP($A124,'GPIO Configuration'!$B$4:$L$97,11,FALSE)=\"1 - 使能\",1,0))","v":0},{"$f":"IF(ISNA(VLOOKUP($A124,'GPIO Configuration'!$B$4:$I$97,8,FALSE)),0,IF(VLOOKUP($A124,'GPIO Configuration'!$B$4:$I$97,8,FALSE)=\"上拉\",2,IF(VLOOKUP($A124,'GPIO Configuration'!$B$4:$I$97,8,FALSE)=\"下拉\",1,0)))","v":0},{"$f":"IF(ISNA(VLOOKUP($A124,'GPIO Configuration'!$B$4:$G$97,6,FALSE)),0,MATCH(VLOOKUP($A124,'GPIO Configuration'!$B$4:$G$97,6,FALSE),INDIRECT($A124&\"_Func\"),0)-1)","v":0},{"$f":"IF(ISNA(VLOOKUP($A124,'GPIO Configuration'!$B$4:$H$97,7,FALSE)),0,MATCH(VLOOKUP($A124,'GPIO Configuration'!$B$4:$H$97,7,FALSE),INDIRECT($A124&\"_OutDrv\"),0)-1)","v":0},{"$f":"IF(ISNA(VLOOKUP($A124,'GPIO Configuration'!$B$4:$M$97,12,FALSE)),0,IF(VLOOKUP($A124,'GPIO Configuration'!$B$4:$M$97,12,FALSE)=\"OUT - 输出\",1,0))","v":0},{"$f":"IF(ISNA(VLOOKUP($A124,'GPIO Configuration'!$B$4:$N$97,13,FALSE)),0,IF(VLOOKUP($A124,'GPIO Configuration'!$B$4:$N$97,13,FALSE)=\"1 - 高电平\",1,0))","v":0},{"$f":"IF(ISNA(VLOOKUP($A124,'GPIO Configuration'!$B$4:$S$97,18,FALSE)),0,IF(VLOOKUP($A124,'GPIO Configuration'!$B$4:$S$97,18,FALSE)=\"1 - 使能\",1,0))","v":0},{"$f":"IF(ISNA(VLOOKUP($A124,'GPIO Configuration'!$B$4:$R$97,17,FALSE)),0,MATCH(VLOOKUP($A124,'GPIO Configuration'!$B$4:$R$97,17,FALSE),INDIRECT($A124&\"_InLv\"),0)-1)","v":0},{"$f":"IF(ISNA(VLOOKUP($A124,'GPIO Configuration'!$B$4:$T$97,19,FALSE)),0,IF(VLOOKUP($A124,'GPIO Configuration'!$B$4:$T$97,19,FALSE)=\"1 - 使能\",1,0))","v":0},{"$f":"IF(ISNA(VLOOKUP($A124,'GPIO Configuration'!$B$4:$Q$97,16,FALSE)),0,IF(VLOOKUP($A124,'GPIO Configuration'!$B$4:$Q$97,16,FALSE)=\"上拉\",2,IF(VLOOKUP($A124,'GPIO Configuration'!$B$4:$Q$97,16,FALSE)=\"下拉\",1,0)))","v":0},{"$f":"IF(ISNA(VLOOKUP($A124,'GPIO Configuration'!$B$4:$O$97,14,FALSE)),0,MATCH(VLOOKUP($A124,'GPIO Configuration'!$B$4:$O$97,14,FALSE),INDIRECT($A124&\"_Func\"),0)-1)","v":0},{"$f":"IF(ISNA(VLOOKUP($A124,'GPIO Configuration'!$B$4:$P$97,15,FALSE)),0,MATCH(VLOOKUP($A124,'GPIO Configuration'!$B$4:$P$97,15,FALSE),INDIRECT($A124&\"_OutDrv\"),0)-1)","v":0}]
["P3_28",3,28,"0x007C","GPIO_PODR3_POD28","GPIO_PIDR3_PID28",{"$f":"IF(ISNA(VLOOKUP($A125,'GPIO Configuration'!$B$4:$C$97,2,FALSE)),0,1)","v":0},{"$f":"IF(ISNA(VLOOKUP($A125,'GPIO Configuration'!$B$4:$C$97,2,FALSE)),0,IF(VLOOKUP($A125,'GPIO Configuration'!$B$4:$C$97,2,FALSE)=\"是\",1,0))","v":0},{"$f":"IF(ISNA(VLOOKUP($A125,'GPIO Configuration'!$B$4:$D$97,3,FALSE)),\"\",TRIM(VLOOKUP($A125,'GPIO Configuration'!$B$4:$D$97,3,FALSE)))","v":""},{"$f":"IF(ISNA(VLOOKUP($A125,'GPIO Configuration'!$B$4:$E$97,4,FALSE)),0,IF(VLOOKUP($A125,'GPIO Configuration'!$B$4:$E$97,4,FALSE)=\"OUT - 输出\",1,0))","v":0},{"$f":"IF(ISNA(VLOOKUP($A125,'GPIO Configuration'!$B$4:$F$97,5,FALSE)),0,IF(VLOOKUP($A125,'GPIO Configuration'!$B$4:$F$97,5,FALSE)=\"1 - 高电平\",1,0))","v":0},{"$f":"IF(ISNA(VLOOKUP($A125,'GPIO Configuration'!$B$4:$K$97,10,FALSE)),0,IF(VLOOKUP($A125,'GPIO Configuration'!$B$4:$K$97,10,FALSE)=\"1 - 使能\",1,0))","v":0},{"$f":"IF(ISNA(VLOOKUP($A125,'GPIO Configuration'!$B$4:$J$97,9,FALSE)),0,MATCH(VLOOKUP($A125,'GPIO Configuration'!$B$4:$J$97,9,FALSE),INDIRECT($A125&\"_InLv\"),0)-1)","v":0},{"$f":"IF(ISNA(VLOOKUP($A125,'GPIO Configuration'!$B$4:$L$97,11,FALSE)),0,IF(VLOOKUP($A125,'GPIO Configuration'!$B$4:$L$97,11,FALSE)=\"1 - 使能\",1,0))","v":0},{"$f":"IF(ISNA(VLOOKUP($A125,'GPIO Configuration'!$B$4:$I$97,8,FALSE)),0,IF(VLOOKUP($A125,'GPIO Configuration'!$B$4:$I$97,8,FALSE)=\"上拉\",2,IF(VLOOKUP($A125,'GPIO Configuration'!$B$4:$I$97,8,FALSE)=\"下拉\",1,0)))","v":0},{"$f":"IF(ISNA(VLOOKUP($A125,'GPIO Configuration'!$B$4:$G$97,6,FALSE)),0,MATCH(VLOOKUP($A125,'GPIO Configuration'!$B$4:$G$97,6,FALSE),INDIRECT($A125&\"_Func\"),0)-1)","v":0},{"$f":"IF(ISNA(VLOOKUP($A125,'GPIO Configuration'!$B$4:$H$97,7,FALSE)),0,MATCH(VLOOKUP($A125,'GPIO Configuration'!$B$4:$H$97,7,FALSE),INDIRECT($A125&\"_OutDrv\"),0)-1)","v":0},{"$f":"IF(ISNA(VLOOKUP($A125,'GPIO Configuration'!$B$4:$M$97,12,FALSE)),0,IF(VLOOKUP($A125,'GPIO Configuration'!$B$4:$M$97,12,FALSE)=\"OUT - 输出\",1,0))","v":0},{"$f":"IF(ISNA(VLOOKUP($A125,'GPIO Configuration'!$B$4:$N$97,13,FALSE)),0,IF(VLOOKUP($A125,'GPIO Configuration'!$B$4:$N$97,13,FALSE)=\"1 - 高电平\",1,0))","v":0},{"$f":"IF(ISNA(VLOOKUP($A125,'GPIO Configuration'!$B$4:$S$97,18,FALSE)),0,IF(VLOOKUP($A125,'GPIO Configuration'!$B$4:$S$97,18,FALSE)=\"1 - 使能\",1,0))","v":0},{"$f":"IF(ISNA(VLOOKUP($A125,'GPIO Configuration'!$B$4:$R$97,17,FALSE)),0,MATCH(VLOOKUP($A125,'GPIO Configuration'!$B$4:$R$97,17,FALSE),INDIRECT($A125&\"_InLv\"),0)-1)","v":0},{"$f":"IF(ISNA(VLOOKUP($A125,'GPIO Configuration'!$B$4:$T$97,19,FALSE)),0,IF(VLOOKUP($A125,'GPIO Configuration'!$B$4:$T$97,19,FALSE)=\"1 - 使能\",1,0))","v":0},{"$f":"IF(ISNA(VLOOKUP($A125,'GPIO Configuration'!$B$4:$Q$97,16,FALSE)),0,IF(VLOOKUP($A125,'GPIO Configuration'!$B$4:$Q$97,16,FALSE)=\"上拉\",2,IF(VLOOKUP($A125,'GPIO Configuration'!$B$4:$Q$97,16,FALSE)=\"下拉\",1,0)))","v":0},{"$f":"IF(ISNA(VLOOKUP($A125,'GPIO Configuration'!$B$4:$O$97,14,FALSE)),0,MATCH(VLOOKUP($A125,'GPIO Configuration'!$B$4:$O$97,14,FALSE),INDIRECT($A125&\"_Func\"),0)-1)","v":0},{"$f":"IF(ISNA(VLOOKUP($A125,'GPIO Configuration'!$B$4:$P$97,15,FALSE)),0,MATCH(VLOOKUP($A125,'GPIO Configuration'!$B$4:$P$97,15,FALSE),INDIRECT($A125&\"_OutDrv\"),0)-1)","v":0}]
["P3_29",3,29,"0x007D","GPIO_PODR3_POD29","GPIO_PIDR3_PID29",{"$f":"IF(ISNA(VLOOKUP($A126,'GPIO Configuration'!$B$4:$C$97,2,FALSE)),0,1)","v":0},{"$f":"IF(ISNA(VLOOKUP($A126,'GPIO Configuration'!$B$4:$C$97,2,FALSE)),0,IF(VLOOKUP($A126,'GPIO Configuration'!$B$4:$C$97,2,FALSE)=\"是\",1,0))","v":0},{"$f":"IF(ISNA(VLOOKUP($A126,'GPIO Configuration'!$B$4:$D$97,3,FALSE)),\"\",TRIM(VLOOKUP($A126,'GPIO Configuration'!$B$4:$D$97,3,FALSE)))","v":""},{"$f":"IF(ISNA(VLOOKUP($A126,'GPIO Configuration'!$B$4:$E$97,4,FALSE)),0,IF(VLOOKUP($A126,'GPIO Configuration'!$B$4:$E$97,4,FALSE)=\"OUT - 输出\",1,0))","v":0},{"$f":"IF(ISNA(VLOOKUP($A126,'GPIO Configuration'!$B$4:$F$97,5,FALSE)),0,IF(VLOOKUP($A126,'GPIO Configuration'!$B$4:$F$97,5,FALSE)=\"1 - 高电平\",1,0))","v":0},{"$f":"IF(ISNA(VLOOKUP($A126,'GPIO Configuration'!$B$4:$K$97,10,FALSE)),0,IF(VLOOKUP($A126,'GPIO Configuration'!$B$4:$K$97,10,FALSE)=\"1 - 使能\",1,0))","v":0},{"$f":"IF(ISNA(VLOOKUP($A126,'GPIO Configuration'!$B$4:$J$97,9,FALSE)),0,MATCH(VLOOKUP($A126,'GPIO Configuration'!$B$4:$J$97,9,FALSE),INDIRECT($A126&\"_InLv\"),0)-1)","v":0},{"$f":"IF(ISNA(VLOOKUP($A126,'GPIO Configuration'!$B$4:$L$97,11,FALSE)),0,IF(VLOOKUP($A126,'GPIO Configuration'!$B$4:$L$97,11,FALSE)=\"1 - 使能\",1,0))","v":0},{"$f":"IF(ISNA(VLOOKUP($A126,'GPIO Configuration'!$B$4:$I$97,8,FALSE)),0,IF(VLOOKUP($A126,'GPIO Configuration'!$B$4:$I$97,8,FALSE)=\"上拉\",2,IF(VLOOKUP($A126,'GPIO Configuration'!$B$4:$I$97,8,FALSE)=\"下拉\",1,0)))","v":0},{"$f":"IF(ISNA(VLOOKUP($A126,'GPIO Configuration'!$B$4:$G$97,6,FALSE)),0,MATCH(VLOOKUP($A126,'GPIO Configuration'!$B$4:$G$97,6,FALSE),INDIRECT($A126&\"_Func\"),0)-1)","v":0},{"$f":"IF(ISNA(VLOOKUP($A126,'GPIO Configuration'!$B$4:$H$97,7,FALSE)),0,MATCH(VLOOKUP($A126,'GPIO Configuration'!$B$4:$H$97,7,FALSE),INDIRECT($A126&\"_OutDrv\"),0)-1)","v":0},{"$f":"IF(ISNA(VLOOKUP($A126,'GPIO Configuration'!$B$4:$M$97,12,FALSE)),0,IF(VLOOKUP($A126,'GPIO Configuration'!$B$4:$M$97,12,FALSE)=\"OUT - 输出\",1,0))","v":0},{"$f":"IF(ISNA(VLOOKUP($A126,'GPIO Configuration'!$B$4:$N$97,13,FALSE)),0,IF(VLOOKUP($A126,'GPIO Configuration'!$B$4:$N$97,13,FALSE)=\"1 - 高电平\",1,0))","v":0},{"$f":"IF(ISNA(VLOOKUP($A126,'GPIO Configuration'!$B$4:$S$97,18,FALSE)),0,IF(VLOOKUP($A126,'GPIO Configuration'!$B$4:$S$97,18,FALSE)=\"1 - 使能\",1,0))","v":0},{"$f":"IF(ISNA(VLOOKUP($A126,'GPIO Configuration'!$B$4:$R$97,17,FALSE)),0,MATCH(VLOOKUP($A126,'GPIO Configuration'!$B$4:$R$97,17,FALSE),INDIRECT($A126&\"_InLv\"),0)-1)","v":0},{"$f":"IF(ISNA(VLOOKUP($A126,'GPIO Configuration'!$B$4:$T$97,19,FALSE)),0,IF(VLOOKUP($A126,'GPIO Configuration'!$B$4:$T$97,19,FALSE)=\"1 - 使能\",1,0))","v":0},{"$f":"IF(ISNA(VLOOKUP($A126,'GPIO Configuration'!$B$4:$Q$97,16,FALSE)),0,IF(VLOOKUP($A126,'GPIO Configuration'!$B$4:$Q$97,16,FALSE)=\"上拉\",2,IF(VLOOKUP($A126,'GPIO Configuration'!$B$4:$Q$97,16,FALSE)=\"下拉\",1,0)))","v":0},{"$f":"IF(ISNA(VLOOKUP($A126,'GPIO Configuration'!$B$4:$O$97,14,FALSE)),0,MATCH(VLOOKUP($A126,'GPIO Configuration'!$B$4:$O$97,14,FALSE),INDIRECT($A126&\"_Func\"),0)-1)","v":0},{"$f":"IF(ISNA(VLOOKUP($A126,'GPIO Configuration'!$B$4:$P$97,15,FALSE)),0,MATCH(VLOOKUP($A126,'GPIO Configuration'!$B$4:$P$97,15,FALSE),INDIRECT($A126&\"_OutDrv\"),0)-1)","v":0}]
["P3_30",3,30,"0x007E","GPIO_PODR3_POD30","GPIO_PIDR3_PID30",{"$f":"IF(ISNA(VLOOKUP($A127,'GPIO Configuration'!$B$4:$C$97,2,FALSE)),0,1)","v":0},{"$f":"IF(ISNA(VLOOKUP($A127,'GPIO Configuration'!$B$4:$C$97,2,FALSE)),0,IF(VLOOKUP($A127,'GPIO Configuration'!$B$4:$C$97,2,FALSE)=\"是\",1,0))","v":0},{"$f":"IF(ISNA(VLOOKUP($A127,'GPIO Configuration'!$B$4:$D$97,3,FALSE)),\"\",TRIM(VLOOKUP($A127,'GPIO Configuration'!$B$4:$D$97,3,FALSE)))","v":""},{"$f":"IF(ISNA(VLOOKUP($A127,'GPIO Configuration'!$B$4:$E$97,4,FALSE)),0,IF(VLOOKUP($A127,'GPIO Configuration'!$B$4:$E$97,4,FALSE)=\"OUT - 输出\",1,0))","v":0},{"$f":"IF(ISNA(VLOOKUP($A127,'GPIO Configuration'!$B$4:$F$97,5,FALSE)),0,IF(VLOOKUP($A127,'GPIO Configuration'!$B$4:$F$97,5,FALSE)=\"1 - 高电平\",1,0))","v":0},{"$f":"IF(ISNA(VLOOKUP($A127,'GPIO Configuration'!$B$4:$K$97,10,FALSE)),0,IF(VLOOKUP($A127,'GPIO Configuration'!$B$4:$K$97,10,FALSE)=\"1 - 使能\",1,0))","v":0},{"$f":"IF(ISNA(VLOOKUP($A127,'GPIO Configuration'!$B$4:$J$97,9,FALSE)),0,MATCH(VLOOKUP($A127,'GPIO Configuration'!$B$4:$J$97,9,FALSE),INDIRECT($A127&\"_InLv\"),0)-1)","v":0},{"$f":"IF(ISNA(VLOOKUP($A127,'GPIO Configuration'!$B$4:$L$97,11,FALSE)),0,IF(VLOOKUP($A127,'GPIO Configuration'!$B$4:$L$97,11,FALSE)=\"1 - 使能\",1,0))","v":0},{"$f":"IF(ISNA(VLOOKUP($A127,'GPIO Configuration'!$B$4:$I$97,8,FALSE)),0,IF(VLOOKUP($A127,'GPIO Configuration'!$B$4:$I$97,8,FALSE)=\"上拉\",2,IF(VLOOKUP($A127,'GPIO Configuration'!$B$4:$I$97,8,FALSE)=\"下拉\",1,0)))","v":0},{"$f":"IF(ISNA(VLOOKUP($A127,'GPIO Configuration'!$B$4:$G$97,6,FALSE)),0,MATCH(VLOOKUP($A127,'GPIO Configuration'!$B$4:$G$97,6,FALSE),INDIRECT($A127&\"_Func\"),0)-1)","v":0},{"$f":"IF(ISNA(VLOOKUP($A127,'GPIO Configuration'!$B$4:$H$97,7,FALSE)),0,MATCH(VLOOKUP($A127,'GPIO Configuration'!$B$4:$H$97,7,FALSE),INDIRECT($A127&\"_OutDrv\"),0)-1)","v":0},{"$f":"IF(ISNA(VLOOKUP($A127,'GPIO Configuration'!$B$4:$M$97,12,FALSE)),0,IF(VLOOKUP($A127,'GPIO Configuration'!$B$4:$M$97,12,FALSE)=\"OUT - 输出\",1,0))","v":0},{"$f":"IF(ISNA(VLOOKUP($A127,'GPIO Configuration'!$B$4:$N$97,13,FALSE)),0,IF(VLOOKUP($A127,'GPIO Configuration'!$B$4:$N$97,13,FALSE)=\"1 - 高电平\",1,0))","v":0},{"$f":"IF(ISNA(VLOOKUP($A127,'GPIO Configuration'!$B$4:$S$97,18,FALSE)),0,IF(VLOOKUP($A127,'GPIO Configuration'!$B$4:$S$97,18,FALSE)=\"1 - 使能\",1,0))","v":0},{"$f":"IF(ISNA(VLOOKUP($A127,'GPIO Configuration'!$B$4:$R$97,17,FALSE)),0,MATCH(VLOOKUP($A127,'GPIO Configuration'!$B$4:$R$97,17,FALSE),INDIRECT($A127&\"_InLv\"),0)-1)","v":0},{"$f":"IF(ISNA(VLOOKUP($A127,'GPIO Configuration'!$B$4:$T$97,19,FALSE)),0,IF(VLOOKUP($A127,'GPIO Configuration'!$B$4:$T$97,19,FALSE)=\"1 - 使能\",1,0))","v":0},{"$f":"IF(ISNA(VLOOKUP($A127,'GPIO Configuration'!$B$4:$Q$97,16,FALSE)),0,IF(VLOOKUP($A127,'GPIO Configuration'!$B$4:$Q$97,16,FALSE)=\"上拉\",2,IF(VLOOKUP($A127,'GPIO Configuration'!$B$4:$Q$97,16,FALSE)=\"下拉\",1,0)))","v":0},{"$f":"IF(ISNA(VLOOKUP($A127,'GPIO Configuration'!$B$4:$O$97,14,FALSE)),0,MATCH(VLOOKUP($A127,'GPIO Configuration'!$B$4:$O$97,14,FALSE),INDIRECT($A127&\"_Func\"),0)-1)","v":0},{"$f":"IF(ISNA(VLOOKUP($A127,'GPIO Configuration'!$B$4:$P$97,15,FALSE)),0,MATCH(VLOOKUP($A127,'GPIO Configuration'!$B$4:$P$97,15,FALSE),INDIRECT($A127&\"_OutDrv\"),0)-1)","v":0}]
["P3_31",3,31,"0x007F","GPIO_PODR3_POD31","GPIO_PIDR3_PID31",{"$f":"IF(ISNA(VLOOKUP($A128,'GPIO Configuration'!$B$4:$C$97,2,FALSE)),0,1)","v":0},{"$f":"IF(ISNA(VLOOKUP($A128,'GPIO Configuration'!$B$4:$C$97,2,FALSE)),0,IF(VLOOKUP($A128,'GPIO Configuration'!$B$4:$C$97,2,FALSE)=\"是\",1,0))","v":0},{"$f":"IF(ISNA(VLOOKUP($A128,'GPIO Configuration'!$B$4:$D$97,3,FALSE)),\"\",TRIM(VLOOKUP($A128,'GPIO Configuration'!$B$4:$D$97,3,FALSE)))","v":""},{"$f":"IF(ISNA(VLOOKUP($A128,'GPIO Configuration'!$B$4:$E$97,4,FALSE)),0,IF(VLOOKUP($A128,'GPIO Configuration'!$B$4:$E$97,4,FALSE)=\"OUT - 输出\",1,0))","v":0},{"$f":"IF(ISNA(VLOOKUP($A128,'GPIO Configuration'!$B$4:$F$97,5,FALSE)),0,IF(VLOOKUP($A128,'GPIO Configuration'!$B$4:$F$97,5,FALSE)=\"1 - 高电平\",1,0))","v":0},{"$f":"IF(ISNA(VLOOKUP($A128,'GPIO Configuration'!$B$4:$K$97,10,FALSE)),0,IF(VLOOKUP($A128,'GPIO Configuration'!$B$4:$K$97,10,FALSE)=\"1 - 使能\",1,0))","v":0},{"$f":"IF(ISNA(VLOOKUP($A128,'GPIO Configuration'!$B$4:$J$97,9,FALSE)),0,MATCH(VLOOKUP($A128,'GPIO Configuration'!$B$4:$J$97,9,FALSE),INDIRECT($A128&\"_InLv\"),0)-1)","v":0},{"$f":"IF(ISNA(VLOOKUP($A128,'GPIO Configuration'!$B$4:$L$97,11,FALSE)),0,IF(VLOOKUP($A128,'GPIO Configuration'!$B$4:$L$97,11,FALSE)=\"1 - 使能\",1,0))","v":0},{"$f":"IF(ISNA(VLOOKUP($A128,'GPIO Configuration'!$B$4:$I$97,8,FALSE)),0,IF(VLOOKUP($A128,'GPIO Configuration'!$B$4:$I$97,8,FALSE)=\"上拉\",2,IF(VLOOKUP($A128,'GPIO Configuration'!$B$4:$I$97,8,FALSE)=\"下拉\",1,0)))","v":0},{"$f":"IF(ISNA(VLOOKUP($A128,'GPIO Configuration'!$B$4:$G$97,6,FALSE)),0,MATCH(VLOOKUP($A128,'GPIO Configuration'!$B$4:$G$97,6,FALSE),INDIRECT($A128&\"_Func\"),0)-1)","v":0},{"$f":"IF(ISNA(VLOOKUP($A128,'GPIO Configuration'!$B$4:$H$97,7,FALSE)),0,MATCH(VLOOKUP($A128,'GPIO Configuration'!$B$4:$H$97,7,FALSE),INDIRECT($A128&\"_OutDrv\"),0)-1)","v":0},{"$f":"IF(ISNA(VLOOKUP($A128,'GPIO Configuration'!$B$4:$M$97,12,FALSE)),0,IF(VLOOKUP($A128,'GPIO Configuration'!$B$4:$M$97,12,FALSE)=\"OUT - 输出\",1,0))","v":0},{"$f":"IF(ISNA(VLOOKUP($A128,'GPIO Configuration'!$B$4:$N$97,13,FALSE)),0,IF(VLOOKUP($A128,'GPIO Configuration'!$B$4:$N$97,13,FALSE)=\"1 - 高电平\",1,0))","v":0},{"$f":"IF(ISNA(VLOOKUP($A128,'GPIO Configuration'!$B$4:$S$97,18,FALSE)),0,IF(VLOOKUP($A128,'GPIO Configuration'!$B$4:$S$97,18,FALSE)=\"1 - 使能\",1,0))","v":0},{"$f":"IF(ISNA(VLOOKUP($A128,'GPIO Configuration'!$B$4:$R$97,17,FALSE)),0,MATCH(VLOOKUP($A128,'GPIO Configuration'!$B$4:$R$97,17,FALSE),INDIRECT($A128&\"_InLv\"),0)-1)","v":0},{"$f":"IF(ISNA(VLOOKUP($A128,'GPIO Configuration'!$B$4:$T$97,19,FALSE)),0,IF(VLOOKUP($A128,'GPIO Configuration'!$B$4:$T$97,19,FALSE)=\"1 - 使能\",1,0))","v":0},{"$f":"IF(ISNA(VLOOKUP($A128,'GPIO Configuration'!$B$4:$Q$97,16,FALSE)),0,IF(VLOOKUP($A128,'GPIO Configuration'!$B$4:$Q$97,16,FALSE)=\"上拉\",2,IF(VLOOKUP($A128,'GPIO Configuration'!$B$4:$Q$97,16,FALSE)=\"下拉\",1,0)))","v":0},{"$f":"IF(ISNA(VLOOKUP($A128,'GPIO Configuration'!$B$4:$O$97,14,FALSE)),0,MATCH(VLOOKUP($A128,'GPIO Configuration'!$B$4:$O$97,14,FALSE),INDIRECT($A128&\"_Func\"),0)-1)","v":0},{"$f":"IF(ISNA(VLOOKUP($A128,'GPIO Configuration'!$B$4:$P$97,15,FALSE)),0,MATCH(VLOOKUP($A128,'GPIO Configuration'!$B$4:$P$97,15,FALSE),INDIRECT($A128&\"_OutDrv\"),0)-1)","v":0}]