{"text_format":"2","workbook":"xlsx","n_sheets":5,"sheets":["GPIO Configuration","Output Functions","Input Level","Output Drive Capacity","Configuration Export"],"not_rendered":{"charts":0,"images":1,"macros":1,"external_links":0,"defined_names":379,"comments":0,"pivot_tables":0},"unopened":[],"bounds":{"document_bytes":16777216,"sheet_cells":100000,"run_cost":"one","rows_first":2000,"rows_last":500,"rows_between":2000,"halvings":0,"cell_chars":16384,"cell_head_chars":4096},"cells_cut":0,"cells_raw":0,"read":"whole","date_system":"1900"}

{"sheet":"GPIO Configuration","index":0,"n_rows":101,"n_cols":20,"rows_kept":101,"cut":false,"hidden":false,"merged":[[0,0,0,3],[0,4,0,17],[1,4,1,11],[1,12,1,19],[1,0,2,0],[1,1,2,1],[1,2,2,2],[1,3,2,3]]}
[{"$nulls":4},"通用输入输出端口配置",{"$nulls":13},"Ver:","1.0.0"]
["引脚编号","端口编号","端口映射","端口映射名称","运行状态",{"$nulls":7},"休眠状态"]
[{"$nulls":4},"端口方向","默认输出电平","输出功能选择","输出驱动能力","上/下拉选择","输入电平选择","输入使能","输入滤波使能","端口方向","默认输出电平","输出功能选择","输出驱动能力","上/下拉选择","输入电平选择","输入使能","输入滤波使能"]
[2,"P0_00","否",null,"OUT - 输出","0 - 低电平","GPIO","5mA","无","CMOS-hys ","0 - 禁止","1 - 使能","OUT - 输出","0 - 低电平","GPIO","1mA ","无","CMOS-hys ","0 - 禁止","1 - 使能"]
[3,"P0_01","否",null,"OUT - 输出","0 - 低电平","GPIO","5mA","无","CMOS-hys ","0 - 禁止","1 - 使能","OUT - 输出","0 - 低电平","GPIO","1mA ","无","CMOS-hys ","0 - 禁止","1 - 使能"]
[4,"P0_02","否",null,"OUT - 输出","0 - 低电平","GPIO","5mA","无","CMOS-hys ","0 - 禁止","1 - 使能","OUT - 输出","0 - 低电平","GPIO","1mA ","无","CMOS-hys ","0 - 禁止","1 - 使能"]
[5,"P0_03","否",null,"OUT - 输出","0 - 低电平","GPIO","5mA","无","CMOS-hys ","0 - 禁止","1 - 使能","OUT - 输出","0 - 低电平","GPIO","1mA ","无","CMOS-hys ","0 - 禁止","1 - 使能"]
[6,"P0_04","否",null,"OUT - 输出","0 - 低电平","GPIO","5mA","无","CMOS-hys ","0 - 禁止","1 - 使能","OUT - 输出","0 - 低电平","GPIO","1mA ","无","CMOS-hys ","0 - 禁止","1 - 使能"]
{"$rows_left_out":94}
{"sheet":"Output Functions","index":1,"n_rows":129,"n_cols":11,"rows_kept":129,"cut":false,"hidden":false,"merged":[[0,0,0,10],[1,3,1,10],[1,0,2,0],[1,1,2,1],[1,2,2,2]]}
["Port Output Function Configuration"]
["Register","Offset","Port","Resource Functional Outputs"]
[null,null,null,"POF=0 ","POF=1 ","POF=2 ","POF=3 ","POF=4 ","POF=5 ","POF=6 ","POF=7"]
["PPC_PCFGR000","0x0000","P0_00","GPIO","- ","LCDD12","MFS7_SOT_1","I2S1_SD_0 ","-","BT0_TIOA1_1","MAD8"]
["PPC_PCFGR001","0x0002","P0_01","GPIO","- ","LCDD13","MFS7_SCK_1","I2S1_WS_0","-","BT1_TIOA2_1","MAD9"]
["PPC_PCFGR002","0x0004","P0_02","GPIO","- ","LCDD14 ","-","I2S1_SCK_0","-","BT1_TIOA3_1","MAD10"]
["PPC_PCFGR003","0x0006","P0_03","GPIO","MFS1_SOT_1","LCDD15 ","- ","-","PCMP0_BL_1","BT2_TIOA4_1","MAD11"]
["PPC_PCFGR004","0x0008","P0_04","GPIO","MFS1_SCK_1","LCDD16 ","- ","I2S0_SD_0","PCMP0_BH_1","BT2_TIOA5_1","MAD12"]
{"$rows_left_out":122}
{"sheet":"Input Level","index":2,"n_rows":129,"n_cols":7,"rows_kept":129,"cut":false,"hidden":false,"merged":[[0,0,0,6],[1,0,1,1],[1,3,1,6],[1,2,2,2]]}
["Input Level Setting"]
["Pin No. of Package",null,"PORT No.","Value of PPC_PCFGR:PIL[1:0]"]
["TEQFP'-176 ","TEQFP'-144 ",null,"2'b00 ","2'b01 ","2'b10 ","2'b11"]
[2,2,"P0_00","CMOS-hys ","Automotive ","- ","-"]
[3,3,"P0_01","CMOS-hys ","Automotive ","- ","-"]
[4,4,"P0_02","CMOS-hys ","Automotive ","- ","-"]
[5,5,"P0_03","CMOS-hys ","Automotive ","- ","-"]
[6,6,"P0_04","CMOS-hys ","Automotive ","- ","-"]
{"$rows_left_out":122}
{"sheet":"Output Drive Capacity","index":3,"n_rows":129,"n_cols":7,"rows_kept":129,"cut":false,"hidden":false,"merged":[[0,0,0,6],[1,0,1,1],[1,3,1,6],[1,2,2,2]]}
["Output Drive Capacity Setting"]
["Pin No. of Package",null,"PORT NO.","Value of PPC_PCFGR:ODR[1:0]"]
["TEQFP'-176 ","TEQFP'-144 ",null,"2'b00 ","2'b01 ","2'b10 ","2'b11"]
[2,2,"P0_00","1mA ","2mA ","- ","5mA"]
[3,3,"P0_01","1mA ","2mA ","- ","5mA"]
[4,4,"P0_02","1mA ","2mA ","- ","5mA"]
[5,5,"P0_03","1mA ","2mA ","- ","5mA"]
[6,6,"P0_04","1mA ","2mA ","- ","5mA"]
{"$rows_left_out":122}
{"sheet":"Configuration Export","index":4,"n_rows":128,"n_cols":25,"rows_kept":128,"cut":false,"hidden":false,"merged":[[0,9,0,16],[0,17,0,24],[0,0,1,0],[0,1,1,1],[0,2,1,2],[0,3,1,3],[0,4,1,4],[0,5,1,5],[0,6,1,6],[0,7,1,7],[0,8,1,8]]}
["Port Name","Port Number","Bit Number","PCFGR Offset","Output Reg","Input Reg","Valid","Remap","Remap Name","Run Mode",{"$nulls":7},"Sleep Mode"]
[{"$nulls":9},"Direction","Default","Input Enable","Input Level","Filter Enable","Pull Up/Dn","Output Func","Output Drive","Direction","Default","Input Enable","Input Level","Filter Enable","Pull Up/Dn","Output Func","Output Drive"]
["P0_00",0,0,"0x0000","GPIO_PODR0_POD0","GPIO_PIDR0_PID0",{"$f":"IF(ISNA(VLOOKUP($A3,'GPIO Configuration'!$B$4:$C$97,2,FALSE)),0,1)","v":1},{"$f":"IF(ISNA(VLOOKUP($A3,'GPIO Configuration'!$B$4:$C$97,2,FALSE)),0,IF(VLOOKUP($A3,'GPIO Configuration'!$B$4:$C$97,2,FALSE)=\"是\",1,0))","v":0},{"$f":"IF(ISNA(VLOOKUP($A3,'GPIO Configuration'!$B$4:$D$97,3,FALSE)),\"\",TRIM(VLOOKUP($A3,'GPIO Configuration'!$B$4:$D$97,3,FALSE)))","v":""},{"$f":"IF(ISNA(VLOOKUP($A3,'GPIO Configuration'!$B$4:$E$97,4,FALSE)),0,IF(VLOOKUP($A3,'GPIO Configuration'!$B$4:$E$97,4,FALSE)=\"OUT - 输出\",1,0))","v":1},{"$f":"IF(ISNA(VLOOKUP($A3,'GPIO Configuration'!$B$4:$F$97,5,FALSE)),0,IF(VLOOKUP($A3,'GPIO Configuration'!$B$4:$F$97,5,FALSE)=\"1 - 高电平\",1,0))","v":0},{"$f":"IF(ISNA(VLOOKUP($A3,'GPIO Configuration'!$B$4:$K$97,10,FALSE)),0,IF(VLOOKUP($A3,'GPIO Configuration'!$B$4:$K$97,10,FALSE)=\"1 - 使能\",1,0))","v":0},{"$f":"IF(ISNA(VLOOKUP($A3,'GPIO Configuration'!$B$4:$J$97,9,FALSE)),0,MATCH(VLOOKUP($A3,'GPIO Configuration'!$B$4:$J$97,9,FALSE),INDIRECT($A3&\"_InLv\"),0)-1)","v":0},{"$f":"IF(ISNA(VLOOKUP($A3,'GPIO Configuration'!$B$4:$L$97,11,FALSE)),0,IF(VLOOKUP($A3,'GPIO Configuration'!$B$4:$L$97,11,FALSE)=\"1 - 使能\",1,0))","v":1},{"$f":"IF(ISNA(VLOOKUP($A3,'GPIO Configuration'!$B$4:$I$97,8,FALSE)),0,IF(VLOOKUP($A3,'GPIO Configuration'!$B$4:$I$97,8,FALSE)=\"上拉\",2,IF(VLOOKUP($A3,'GPIO Configuration'!$B$4:$I$97,8,FALSE)=\"下拉\",1,0)))","v":0},{"$f":"IF(ISNA(VLOOKUP($A3,'GPIO Configuration'!$B$4:$G$97,6,FALSE)),0,MATCH(VLOOKUP($A3,'GPIO Configuration'!$B$4:$G$97,6,FALSE),INDIRECT($A3&\"_Func\"),0)-1)","v":0},{"$f":"IF(ISNA(VLOOKUP($A3,'GPIO Configuration'!$B$4:$H$97,7,FALSE)),0,MATCH(VLOOKUP($A3,'GPIO Configuration'!$B$4:$H$97,7,FALSE),INDIRECT($A3&\"_OutDrv\"),0)-1)","v":3},{"$f":"IF(ISNA(VLOOKUP($A3,'GPIO Configuration'!$B$4:$M$97,12,FALSE)),0,IF(VLOOKUP($A3,'GPIO Configuration'!$B$4:$M$97,12,FALSE)=\"OUT - 输出\",1,0))","v":1},{"$f":"IF(ISNA(VLOOKUP($A3,'GPIO Configuration'!$B$4:$N$97,13,FALSE)),0,IF(VLOOKUP($A3,'GPIO Configuration'!$B$4:$N$97,13,FALSE)=\"1 - 高电平\",1,0))","v":0},{"$f":"IF(ISNA(VLOOKUP($A3,'GPIO Configuration'!$B$4:$S$97,18,FALSE)),0,IF(VLOOKUP($A3,'GPIO Configuration'!$B$4:$S$97,18,FALSE)=\"1 - 使能\",1,0))","v":0},{"$f":"IF(ISNA(VLOOKUP($A3,'GPIO Configuration'!$B$4:$R$97,17,FALSE)),0,MATCH(VLOOKUP($A3,'GPIO Configuration'!$B$4:$R$97,17,FALSE),INDIRECT($A3&\"_InLv\"),0)-1)","v":0},{"$f":"IF(ISNA(VLOOKUP($A3,'GPIO Configuration'!$B$4:$T$97,19,FALSE)),0,IF(VLOOKUP($A3,'GPIO Configuration'!$B$4:$T$97,19,FALSE)=\"1 - 使能\",1,0))","v":1},{"$f":"IF(ISNA(VLOOKUP($A3,'GPIO Configuration'!$B$4:$Q$97,16,FALSE)),0,IF(VLOOKUP($A3,'GPIO Configuration'!$B$4:$Q$97,16,FALSE)=\"上拉\",2,IF(VLOOKUP($A3,'GPIO Configuration'!$B$4:$Q$97,16,FALSE)=\"下拉\",1,0)))","v":0},{"$f":"IF(ISNA(VLOOKUP($A3,'GPIO Configuration'!$B$4:$O$97,14,FALSE)),0,MATCH(VLOOKUP($A3,'GPIO Configuration'!$B$4:$O$97,14,FALSE),INDIRECT($A3&\"_Func\"),0)-1)","v":0},{"$f":"IF(ISNA(VLOOKUP($A3,'GPIO Configuration'!$B$4:$P$97,15,FALSE)),0,MATCH(VLOOKUP($A3,'GPIO Configuration'!$B$4:$P$97,15,FALSE),INDIRECT($A3&\"_OutDrv\"),0)-1)","v":0}]
["P0_01",0,1,"0x0001","GPIO_PODR0_POD1","GPIO_PIDR0_PID1",{"$f":"IF(ISNA(VLOOKUP($A4,'GPIO Configuration'!$B$4:$C$97,2,FALSE)),0,1)","v":1},{"$f":"IF(ISNA(VLOOKUP($A4,'GPIO Configuration'!$B$4:$C$97,2,FALSE)),0,IF(VLOOKUP($A4,'GPIO Configuration'!$B$4:$C$97,2,FALSE)=\"是\",1,0))","v":0},{"$f":"IF(ISNA(VLOOKUP($A4,'GPIO Configuration'!$B$4:$D$97,3,FALSE)),\"\",TRIM(VLOOKUP($A4,'GPIO Configuration'!$B$4:$D$97,3,FALSE)))","v":""},{"$f":"IF(ISNA(VLOOKUP($A4,'GPIO Configuration'!$B$4:$E$97,4,FALSE)),0,IF(VLOOKUP($A4,'GPIO Configuration'!$B$4:$E$97,4,FALSE)=\"OUT - 输出\",1,0))","v":1},{"$f":"IF(ISNA(VLOOKUP($A4,'GPIO Configuration'!$B$4:$F$97,5,FALSE)),0,IF(VLOOKUP($A4,'GPIO Configuration'!$B$4:$F$97,5,FALSE)=\"1 - 高电平\",1,0))","v":0},{"$f":"IF(ISNA(VLOOKUP($A4,'GPIO Configuration'!$B$4:$K$97,10,FALSE)),0,IF(VLOOKUP($A4,'GPIO Configuration'!$B$4:$K$97,10,FALSE)=\"1 - 使能\",1,0))","v":0},{"$f":"IF(ISNA(VLOOKUP($A4,'GPIO Configuration'!$B$4:$J$97,9,FALSE)),0,MATCH(VLOOKUP($A4,'GPIO Configuration'!$B$4:$J$97,9,FALSE),INDIRECT($A4&\"_InLv\"),0)-1)","v":0},{"$f":"IF(ISNA(VLOOKUP($A4,'GPIO Configuration'!$B$4:$L$97,11,FALSE)),0,IF(VLOOKUP($A4,'GPIO Configuration'!$B$4:$L$97,11,FALSE)=\"1 - 使能\",1,0))","v":1},{"$f":"IF(ISNA(VLOOKUP($A4,'GPIO Configuration'!$B$4:$I$97,8,FALSE)),0,IF(VLOOKUP($A4,'GPIO Configuration'!$B$4:$I$97,8,FALSE)=\"上拉\",2,IF(VLOOKUP($A4,'GPIO Configuration'!$B$4:$I$97,8,FALSE)=\"下拉\",1,0)))","v":0},{"$f":"IF(ISNA(VLOOKUP($A4,'GPIO Configuration'!$B$4:$G$97,6,FALSE)),0,MATCH(VLOOKUP($A4,'GPIO Configuration'!$B$4:$G$97,6,FALSE),INDIRECT($A4&\"_Func\"),0)-1)","v":0},{"$f":"IF(ISNA(VLOOKUP($A4,'GPIO Configuration'!$B$4:$H$97,7,FALSE)),0,MATCH(VLOOKUP($A4,'GPIO Configuration'!$B$4:$H$97,7,FALSE),INDIRECT($A4&\"_OutDrv\"),0)-1)","v":3},{"$f":"IF(ISNA(VLOOKUP($A4,'GPIO Configuration'!$B$4:$M$97,12,FALSE)),0,IF(VLOOKUP($A4,'GPIO Configuration'!$B$4:$M$97,12,FALSE)=\"OUT - 输出\",1,0))","v":1},{"$f":"IF(ISNA(VLOOKUP($A4,'GPIO Configuration'!$B$4:$N$97,13,FALSE)),0,IF(VLOOKUP($A4,'GPIO Configuration'!$B$4:$N$97,13,FALSE)=\"1 - 高电平\",1,0))","v":0},{"$f":"IF(ISNA(VLOOKUP($A4,'GPIO Configuration'!$B$4:$S$97,18,FALSE)),0,IF(VLOOKUP($A4,'GPIO Configuration'!$B$4:$S$97,18,FALSE)=\"1 - 使能\",1,0))","v":0},{"$f":"IF(ISNA(VLOOKUP($A4,'GPIO Configuration'!$B$4:$R$97,17,FALSE)),0,MATCH(VLOOKUP($A4,'GPIO Configuration'!$B$4:$R$97,17,FALSE),INDIRECT($A4&\"_InLv\"),0)-1)","v":0},{"$f":"IF(ISNA(VLOOKUP($A4,'GPIO Configuration'!$B$4:$T$97,19,FALSE)),0,IF(VLOOKUP($A4,'GPIO Configuration'!$B$4:$T$97,19,FALSE)=\"1 - 使能\",1,0))","v":1},{"$f":"IF(ISNA(VLOOKUP($A4,'GPIO Configuration'!$B$4:$Q$97,16,FALSE)),0,IF(VLOOKUP($A4,'GPIO Configuration'!$B$4:$Q$97,16,FALSE)=\"上拉\",2,IF(VLOOKUP($A4,'GPIO Configuration'!$B$4:$Q$97,16,FALSE)=\"下拉\",1,0)))","v":0},{"$f":"IF(ISNA(VLOOKUP($A4,'GPIO Configuration'!$B$4:$O$97,14,FALSE)),0,MATCH(VLOOKUP($A4,'GPIO Configuration'!$B$4:$O$97,14,FALSE),INDIRECT($A4&\"_Func\"),0)-1)","v":0},{"$f":"IF(ISNA(VLOOKUP($A4,'GPIO Configuration'!$B$4:$P$97,15,FALSE)),0,MATCH(VLOOKUP($A4,'GPIO Configuration'!$B$4:$P$97,15,FALSE),INDIRECT($A4&\"_OutDrv\"),0)-1)","v":0}]
["P0_02",0,2,"0x0002","GPIO_PODR0_POD2","GPIO_PIDR0_PID2",{"$f":"IF(ISNA(VLOOKUP($A5,'GPIO Configuration'!$B$4:$C$97,2,FALSE)),0,1)","v":1},{"$f":"IF(ISNA(VLOOKUP($A5,'GPIO Configuration'!$B$4:$C$97,2,FALSE)),0,IF(VLOOKUP($A5,'GPIO Configuration'!$B$4:$C$97,2,FALSE)=\"是\",1,0))","v":0},{"$f":"IF(ISNA(VLOOKUP($A5,'GPIO Configuration'!$B$4:$D$97,3,FALSE)),\"\",TRIM(VLOOKUP($A5,'GPIO Configuration'!$B$4:$D$97,3,FALSE)))","v":""},{"$f":"IF(ISNA(VLOOKUP($A5,'GPIO Configuration'!$B$4:$E$97,4,FALSE)),0,IF(VLOOKUP($A5,'GPIO Configuration'!$B$4:$E$97,4,FALSE)=\"OUT - 输出\",1,0))","v":1},{"$f":"IF(ISNA(VLOOKUP($A5,'GPIO Configuration'!$B$4:$F$97,5,FALSE)),0,IF(VLOOKUP($A5,'GPIO Configuration'!$B$4:$F$97,5,FALSE)=\"1 - 高电平\",1,0))","v":0},{"$f":"IF(ISNA(VLOOKUP($A5,'GPIO Configuration'!$B$4:$K$97,10,FALSE)),0,IF(VLOOKUP($A5,'GPIO Configuration'!$B$4:$K$97,10,FALSE)=\"1 - 使能\",1,0))","v":0},{"$f":"IF(ISNA(VLOOKUP($A5,'GPIO Configuration'!$B$4:$J$97,9,FALSE)),0,MATCH(VLOOKUP($A5,'GPIO Configuration'!$B$4:$J$97,9,FALSE),INDIRECT($A5&\"_InLv\"),0)-1)","v":0},{"$f":"IF(ISNA(VLOOKUP($A5,'GPIO Configuration'!$B$4:$L$97,11,FALSE)),0,IF(VLOOKUP($A5,'GPIO Configuration'!$B$4:$L$97,11,FALSE)=\"1 - 使能\",1,0))","v":1},{"$f":"IF(ISNA(VLOOKUP($A5,'GPIO Configuration'!$B$4:$I$97,8,FALSE)),0,IF(VLOOKUP($A5,'GPIO Configuration'!$B$4:$I$97,8,FALSE)=\"上拉\",2,IF(VLOOKUP($A5,'GPIO Configuration'!$B$4:$I$97,8,FALSE)=\"下拉\",1,0)))","v":0},{"$f":"IF(ISNA(VLOOKUP($A5,'GPIO Configuration'!$B$4:$G$97,6,FALSE)),0,MATCH(VLOOKUP($A5,'GPIO Configuration'!$B$4:$G$97,6,FALSE),INDIRECT($A5&\"_Func\"),0)-1)","v":0},{"$f":"IF(ISNA(VLOOKUP($A5,'GPIO Configuration'!$B$4:$H$97,7,FALSE)),0,MATCH(VLOOKUP($A5,'GPIO Configuration'!$B$4:$H$97,7,FALSE),INDIRECT($A5&\"_OutDrv\"),0)-1)","v":3},{"$f":"IF(ISNA(VLOOKUP($A5,'GPIO Configuration'!$B$4:$M$97,12,FALSE)),0,IF(VLOOKUP($A5,'GPIO Configuration'!$B$4:$M$97,12,FALSE)=\"OUT - 输出\",1,0))","v":1},{"$f":"IF(ISNA(VLOOKUP($A5,'GPIO Configuration'!$B$4:$N$97,13,FALSE)),0,IF(VLOOKUP($A5,'GPIO Configuration'!$B$4:$N$97,13,FALSE)=\"1 - 高电平\",1,0))","v":0},{"$f":"IF(ISNA(VLOOKUP($A5,'GPIO Configuration'!$B$4:$S$97,18,FALSE)),0,IF(VLOOKUP($A5,'GPIO Configuration'!$B$4:$S$97,18,FALSE)=\"1 - 使能\",1,0))","v":0},{"$f":"IF(ISNA(VLOOKUP($A5,'GPIO Configuration'!$B$4:$R$97,17,FALSE)),0,MATCH(VLOOKUP($A5,'GPIO Configuration'!$B$4:$R$97,17,FALSE),INDIRECT($A5&\"_InLv\"),0)-1)","v":0},{"$f":"IF(ISNA(VLOOKUP($A5,'GPIO Configuration'!$B$4:$T$97,19,FALSE)),0,IF(VLOOKUP($A5,'GPIO Configuration'!$B$4:$T$97,19,FALSE)=\"1 - 使能\",1,0))","v":1},{"$f":"IF(ISNA(VLOOKUP($A5,'GPIO Configuration'!$B$4:$Q$97,16,FALSE)),0,IF(VLOOKUP($A5,'GPIO Configuration'!$B$4:$Q$97,16,FALSE)=\"上拉\",2,IF(VLOOKUP($A5,'GPIO Configuration'!$B$4:$Q$97,16,FALSE)=\"下拉\",1,0)))","v":0},{"$f":"IF(ISNA(VLOOKUP($A5,'GPIO Configuration'!$B$4:$O$97,14,FALSE)),0,MATCH(VLOOKUP($A5,'GPIO Configuration'!$B$4:$O$97,14,FALSE),INDIRECT($A5&\"_Func\"),0)-1)","v":0},{"$f":"IF(ISNA(VLOOKUP($A5,'GPIO Configuration'!$B$4:$P$97,15,FALSE)),0,MATCH(VLOOKUP($A5,'GPIO Configuration'!$B$4:$P$97,15,FALSE),INDIRECT($A5&\"_OutDrv\"),0)-1)","v":0}]
["P0_03",0,3,"0x0003","GPIO_PODR0_POD3","GPIO_PIDR0_PID3",{"$f":"IF(ISNA(VLOOKUP($A6,'GPIO Configuration'!$B$4:$C$97,2,FALSE)),0,1)","v":1},{"$f":"IF(ISNA(VLOOKUP($A6,'GPIO Configuration'!$B$4:$C$97,2,FALSE)),0,IF(VLOOKUP($A6,'GPIO Configuration'!$B$4:$C$97,2,FALSE)=\"是\",1,0))","v":0},{"$f":"IF(ISNA(VLOOKUP($A6,'GPIO Configuration'!$B$4:$D$97,3,FALSE)),\"\",TRIM(VLOOKUP($A6,'GPIO Configuration'!$B$4:$D$97,3,FALSE)))","v":""},{"$f":"IF(ISNA(VLOOKUP($A6,'GPIO Configuration'!$B$4:$E$97,4,FALSE)),0,IF(VLOOKUP($A6,'GPIO Configuration'!$B$4:$E$97,4,FALSE)=\"OUT - 输出\",1,0))","v":1},{"$f":"IF(ISNA(VLOOKUP($A6,'GPIO Configuration'!$B$4:$F$97,5,FALSE)),0,IF(VLOOKUP($A6,'GPIO Configuration'!$B$4:$F$97,5,FALSE)=\"1 - 高电平\",1,0))","v":0},{"$f":"IF(ISNA(VLOOKUP($A6,'GPIO Configuration'!$B$4:$K$97,10,FALSE)),0,IF(VLOOKUP($A6,'GPIO Configuration'!$B$4:$K$97,10,FALSE)=\"1 - 使能\",1,0))","v":0},{"$f":"IF(ISNA(VLOOKUP($A6,'GPIO Configuration'!$B$4:$J$97,9,FALSE)),0,MATCH(VLOOKUP($A6,'GPIO Configuration'!$B$4:$J$97,9,FALSE),INDIRECT($A6&\"_InLv\"),0)-1)","v":0},{"$f":"IF(ISNA(VLOOKUP($A6,'GPIO Configuration'!$B$4:$L$97,11,FALSE)),0,IF(VLOOKUP($A6,'GPIO Configuration'!$B$4:$L$97,11,FALSE)=\"1 - 使能\",1,0))","v":1},{"$f":"IF(ISNA(VLOOKUP($A6,'GPIO Configuration'!$B$4:$I$97,8,FALSE)),0,IF(VLOOKUP($A6,'GPIO Configuration'!$B$4:$I$97,8,FALSE)=\"上拉\",2,IF(VLOOKUP($A6,'GPIO Configuration'!$B$4:$I$97,8,FALSE)=\"下拉\",1,0)))","v":0},{"$f":"IF(ISNA(VLOOKUP($A6,'GPIO Configuration'!$B$4:$G$97,6,FALSE)),0,MATCH(VLOOKUP($A6,'GPIO Configuration'!$B$4:$G$97,6,FALSE),INDIRECT($A6&\"_Func\"),0)-1)","v":0},{"$f":"IF(ISNA(VLOOKUP($A6,'GPIO Configuration'!$B$4:$H$97,7,FALSE)),0,MATCH(VLOOKUP($A6,'GPIO Configuration'!$B$4:$H$97,7,FALSE),INDIRECT($A6&\"_OutDrv\"),0)-1)","v":3},{"$f":"IF(ISNA(VLOOKUP($A6,'GPIO Configuration'!$B$4:$M$97,12,FALSE)),0,IF(VLOOKUP($A6,'GPIO Configuration'!$B$4:$M$97,12,FALSE)=\"OUT - 输出\",1,0))","v":1},{"$f":"IF(ISNA(VLOOKUP($A6,'GPIO Configuration'!$B$4:$N$97,13,FALSE)),0,IF(VLOOKUP($A6,'GPIO Configuration'!$B$4:$N$97,13,FALSE)=\"1 - 高电平\",1,0))","v":0},{"$f":"IF(ISNA(VLOOKUP($A6,'GPIO Configuration'!$B$4:$S$97,18,FALSE)),0,IF(VLOOKUP($A6,'GPIO Configuration'!$B$4:$S$97,18,FALSE)=\"1 - 使能\",1,0))","v":0},{"$f":"IF(ISNA(VLOOKUP($A6,'GPIO Configuration'!$B$4:$R$97,17,FALSE)),0,MATCH(VLOOKUP($A6,'GPIO Configuration'!$B$4:$R$97,17,FALSE),INDIRECT($A6&\"_InLv\"),0)-1)","v":0},{"$f":"IF(ISNA(VLOOKUP($A6,'GPIO Configuration'!$B$4:$T$97,19,FALSE)),0,IF(VLOOKUP($A6,'GPIO Configuration'!$B$4:$T$97,19,FALSE)=\"1 - 使能\",1,0))","v":1},{"$f":"IF(ISNA(VLOOKUP($A6,'GPIO Configuration'!$B$4:$Q$97,16,FALSE)),0,IF(VLOOKUP($A6,'GPIO Configuration'!$B$4:$Q$97,16,FALSE)=\"上拉\",2,IF(VLOOKUP($A6,'GPIO Configuration'!$B$4:$Q$97,16,FALSE)=\"下拉\",1,0)))","v":0},{"$f":"IF(ISNA(VLOOKUP($A6,'GPIO Configuration'!$B$4:$O$97,14,FALSE)),0,MATCH(VLOOKUP($A6,'GPIO Configuration'!$B$4:$O$97,14,FALSE),INDIRECT($A6&\"_Func\"),0)-1)","v":0},{"$f":"IF(ISNA(VLOOKUP($A6,'GPIO Configuration'!$B$4:$P$97,15,FALSE)),0,MATCH(VLOOKUP($A6,'GPIO Configuration'!$B$4:$P$97,15,FALSE),INDIRECT($A6&\"_OutDrv\"),0)-1)","v":0}]
["P0_04",0,4,"0x0004","GPIO_PODR0_POD4","GPIO_PIDR0_PID4",{"$f":"IF(ISNA(VLOOKUP($A7,'GPIO Configuration'!$B$4:$C$97,2,FALSE)),0,1)","v":1},{"$f":"IF(ISNA(VLOOKUP($A7,'GPIO Configuration'!$B$4:$C$97,2,FALSE)),0,IF(VLOOKUP($A7,'GPIO Configuration'!$B$4:$C$97,2,FALSE)=\"是\",1,0))","v":0},{"$f":"IF(ISNA(VLOOKUP($A7,'GPIO Configuration'!$B$4:$D$97,3,FALSE)),\"\",TRIM(VLOOKUP($A7,'GPIO Configuration'!$B$4:$D$97,3,FALSE)))","v":""},{"$f":"IF(ISNA(VLOOKUP($A7,'GPIO Configuration'!$B$4:$E$97,4,FALSE)),0,IF(VLOOKUP($A7,'GPIO Configuration'!$B$4:$E$97,4,FALSE)=\"OUT - 输出\",1,0))","v":1},{"$f":"IF(ISNA(VLOOKUP($A7,'GPIO Configuration'!$B$4:$F$97,5,FALSE)),0,IF(VLOOKUP($A7,'GPIO Configuration'!$B$4:$F$97,5,FALSE)=\"1 - 高电平\",1,0))","v":0},{"$f":"IF(ISNA(VLOOKUP($A7,'GPIO Configuration'!$B$4:$K$97,10,FALSE)),0,IF(VLOOKUP($A7,'GPIO Configuration'!$B$4:$K$97,10,FALSE)=\"1 - 使能\",1,0))","v":0},{"$f":"IF(ISNA(VLOOKUP($A7,'GPIO Configuration'!$B$4:$J$97,9,FALSE)),0,MATCH(VLOOKUP($A7,'GPIO Configuration'!$B$4:$J$97,9,FALSE),INDIRECT($A7&\"_InLv\"),0)-1)","v":0},{"$f":"IF(ISNA(VLOOKUP($A7,'GPIO Configuration'!$B$4:$L$97,11,FALSE)),0,IF(VLOOKUP($A7,'GPIO Configuration'!$B$4:$L$97,11,FALSE)=\"1 - 使能\",1,0))","v":1},{"$f":"IF(ISNA(VLOOKUP($A7,'GPIO Configuration'!$B$4:$I$97,8,FALSE)),0,IF(VLOOKUP($A7,'GPIO Configuration'!$B$4:$I$97,8,FALSE)=\"上拉\",2,IF(VLOOKUP($A7,'GPIO Configuration'!$B$4:$I$97,8,FALSE)=\"下拉\",1,0)))","v":0},{"$f":"IF(ISNA(VLOOKUP($A7,'GPIO Configuration'!$B$4:$G$97,6,FALSE)),0,MATCH(VLOOKUP($A7,'GPIO Configuration'!$B$4:$G$97,6,FALSE),INDIRECT($A7&\"_Func\"),0)-1)","v":0},{"$f":"IF(ISNA(VLOOKUP($A7,'GPIO Configuration'!$B$4:$H$97,7,FALSE)),0,MATCH(VLOOKUP($A7,'GPIO Configuration'!$B$4:$H$97,7,FALSE),INDIRECT($A7&\"_OutDrv\"),0)-1)","v":3},{"$f":"IF(ISNA(VLOOKUP($A7,'GPIO Configuration'!$B$4:$M$97,12,FALSE)),0,IF(VLOOKUP($A7,'GPIO Configuration'!$B$4:$M$97,12,FALSE)=\"OUT - 输出\",1,0))","v":1},{"$f":"IF(ISNA(VLOOKUP($A7,'GPIO Configuration'!$B$4:$N$97,13,FALSE)),0,IF(VLOOKUP($A7,'GPIO Configuration'!$B$4:$N$97,13,FALSE)=\"1 - 高电平\",1,0))","v":0},{"$f":"IF(ISNA(VLOOKUP($A7,'GPIO Configuration'!$B$4:$S$97,18,FALSE)),0,IF(VLOOKUP($A7,'GPIO Configuration'!$B$4:$S$97,18,FALSE)=\"1 - 使能\",1,0))","v":0},{"$f":"IF(ISNA(VLOOKUP($A7,'GPIO Configuration'!$B$4:$R$97,17,FALSE)),0,MATCH(VLOOKUP($A7,'GPIO Configuration'!$B$4:$R$97,17,FALSE),INDIRECT($A7&\"_InLv\"),0)-1)","v":0},{"$f":"IF(ISNA(VLOOKUP($A7,'GPIO Configuration'!$B$4:$T$97,19,FALSE)),0,IF(VLOOKUP($A7,'GPIO Configuration'!$B$4:$T$97,19,FALSE)=\"1 - 使能\",1,0))","v":1},{"$f":"IF(ISNA(VLOOKUP($A7,'GPIO Configuration'!$B$4:$Q$97,16,FALSE)),0,IF(VLOOKUP($A7,'GPIO Configuration'!$B$4:$Q$97,16,FALSE)=\"上拉\",2,IF(VLOOKUP($A7,'GPIO Configuration'!$B$4:$Q$97,16,FALSE)=\"下拉\",1,0)))","v":0},{"$f":"IF(ISNA(VLOOKUP($A7,'GPIO Configuration'!$B$4:$O$97,14,FALSE)),0,MATCH(VLOOKUP($A7,'GPIO Configuration'!$B$4:$O$97,14,FALSE),INDIRECT($A7&\"_Func\"),0)-1)","v":0},{"$f":"IF(ISNA(VLOOKUP($A7,'GPIO Configuration'!$B$4:$P$97,15,FALSE)),0,MATCH(VLOOKUP($A7,'GPIO Configuration'!$B$4:$P$97,15,FALSE),INDIRECT($A7&\"_OutDrv\"),0)-1)","v":0}]
["P0_05",0,5,"0x0005","GPIO_PODR0_POD5","GPIO_PIDR0_PID5",{"$f":"IF(ISNA(VLOOKUP($A8,'GPIO Configuration'!$B$4:$C$97,2,FALSE)),0,1)","v":1},{"$f":"IF(ISNA(VLOOKUP($A8,'GPIO Configuration'!$B$4:$C$97,2,FALSE)),0,IF(VLOOKUP($A8,'GPIO Configuration'!$B$4:$C$97,2,FALSE)=\"是\",1,0))","v":0},{"$f":"IF(ISNA(VLOOKUP($A8,'GPIO Configuration'!$B$4:$D$97,3,FALSE)),\"\",TRIM(VLOOKUP($A8,'GPIO Configuration'!$B$4:$D$97,3,FALSE)))","v":""},{"$f":"IF(ISNA(VLOOKUP($A8,'GPIO Configuration'!$B$4:$E$97,4,FALSE)),0,IF(VLOOKUP($A8,'GPIO Configuration'!$B$4:$E$97,4,FALSE)=\"OUT - 输出\",1,0))","v":1},{"$f":"IF(ISNA(VLOOKUP($A8,'GPIO Configuration'!$B$4:$F$97,5,FALSE)),0,IF(VLOOKUP($A8,'GPIO Configuration'!$B$4:$F$97,5,FALSE)=\"1 - 高电平\",1,0))","v":1},{"$f":"IF(ISNA(VLOOKUP($A8,'GPIO Configuration'!$B$4:$K$97,10,FALSE)),0,IF(VLOOKUP($A8,'GPIO Configuration'!$B$4:$K$97,10,FALSE)=\"1 - 使能\",1,0))","v":0},{"$f":"IF(ISNA(VLOOKUP($A8,'GPIO Configuration'!$B$4:$J$97,9,FALSE)),0,MATCH(VLOOKUP($A8,'GPIO Configuration'!$B$4:$J$97,9,FALSE),INDIRECT($A8&\"_InLv\"),0)-1)","v":0},{"$f":"IF(ISNA(VLOOKUP($A8,'GPIO Configuration'!$B$4:$L$97,11,FALSE)),0,IF(VLOOKUP($A8,'GPIO Configuration'!$B$4:$L$97,11,FALSE)=\"1 - 使能\",1,0))","v":1},{"$f":"IF(ISNA(VLOOKUP($A8,'GPIO Configuration'!$B$4:$I$97,8,FALSE)),0,IF(VLOOKUP($A8,'GPIO Configuration'!$B$4:$I$97,8,FALSE)=\"上拉\",2,IF(VLOOKUP($A8,'GPIO Configuration'!$B$4:$I$97,8,FALSE)=\"下拉\",1,0)))","v":0},{"$f":"IF(ISNA(VLOOKUP($A8,'GPIO Configuration'!$B$4:$G$97,6,FALSE)),0,MATCH(VLOOKUP($A8,'GPIO Configuration'!$B$4:$G$97,6,FALSE),INDIRECT($A8&\"_Func\"),0)-1)","v":0},{"$f":"IF(ISNA(VLOOKUP($A8,'GPIO Configuration'!$B$4:$H$97,7,FALSE)),0,MATCH(VLOOKUP($A8,'GPIO Configuration'!$B$4:$H$97,7,FALSE),INDIRECT($A8&\"_OutDrv\"),0)-1)","v":3},{"$f":"IF(ISNA(VLOOKUP($A8,'GPIO Configuration'!$B$4:$M$97,12,FALSE)),0,IF(VLOOKUP($A8,'GPIO Configuration'!$B$4:$M$97,12,FALSE)=\"OUT - 输出\",1,0))","v":1},{"$f":"IF(ISNA(VLOOKUP($A8,'GPIO Configuration'!$B$4:$N$97,13,FALSE)),0,IF(VLOOKUP($A8,'GPIO Configuration'!$B$4:$N$97,13,FALSE)=\"1 - 高电平\",1,0))","v":0},{"$f":"IF(ISNA(VLOOKUP($A8,'GPIO Configuration'!$B$4:$S$97,18,FALSE)),0,IF(VLOOKUP($A8,'GPIO Configuration'!$B$4:$S$97,18,FALSE)=\"1 - 使能\",1,0))","v":0},{"$f":"IF(ISNA(VLOOKUP($A8,'GPIO Configuration'!$B$4:$R$97,17,FALSE)),0,MATCH(VLOOKUP($A8,'GPIO Configuration'!$B$4:$R$97,17,FALSE),INDIRECT($A8&\"_InLv\"),0)-1)","v":0},{"$f":"IF(ISNA(VLOOKUP($A8,'GPIO Configuration'!$B$4:$T$97,19,FALSE)),0,IF(VLOOKUP($A8,'GPIO Configuration'!$B$4:$T$97,19,FALSE)=\"1 - 使能\",1,0))","v":1},{"$f":"IF(ISNA(VLOOKUP($A8,'GPIO Configuration'!$B$4:$Q$97,16,FALSE)),0,IF(VLOOKUP($A8,'GPIO Configuration'!$B$4:$Q$97,16,FALSE)=\"上拉\",2,IF(VLOOKUP($A8,'GPIO Configuration'!$B$4:$Q$97,16,FALSE)=\"下拉\",1,0)))","v":0},{"$f":"IF(ISNA(VLOOKUP($A8,'GPIO Configuration'!$B$4:$O$97,14,FALSE)),0,MATCH(VLOOKUP($A8,'GPIO Configuration'!$B$4:$O$97,14,FALSE),INDIRECT($A8&\"_Func\"),0)-1)","v":0},{"$f":"IF(ISNA(VLOOKUP($A8,'GPIO Configuration'!$B$4:$P$97,15,FALSE)),0,MATCH(VLOOKUP($A8,'GPIO Configuration'!$B$4:$P$97,15,FALSE),INDIRECT($A8&\"_OutDrv\"),0)-1)","v":0}]
{"$rows_left_out":120}